null
SMILES: COc1ncc(cc1F)-c1cc2c(C)nc(N)nc2n([C@H]2CC[C@@H](CC2)OCO)c1=O
InChI Key: InChIKey=SAQMYGKYGQDHJG-HDJSIYSDSA-N
Activity Spreadsheet -- Enzyme Inhibition Constant Data from BindingDB
Found 3 hits for monomerid = 50433050
Trg + Lig
Ki
nM
ΔG°
kcal/mole
IC50
nM
Kd
nM
EC50/IC50
nM
koff
s-1
kon
M-1s-1
pHTemp
°C
Phosphatidylinositol 4,5-bisphosphate 3-kinase catalytic subunit alpha isoform
(Mus musculus (Mouse))
BDBM50433050
(CHEMBL2375968)
Show SMILES COc1ncc(cc1F)-c1cc2c(C)nc(N)nc2n([C@H]2CC[C@@H](CC2)OCO)c1=O |r,wU:23.28,wD:20.21,(26.25,-15.63,;24.91,-14.86,;23.58,-15.63,;23.58,-17.17,;22.24,-17.93,;20.91,-17.16,;20.91,-15.63,;22.24,-14.86,;22.24,-13.32,;19.57,-17.92,;18.23,-17.13,;16.89,-17.91,;15.55,-17.15,;15.55,-15.61,;14.22,-17.92,;14.22,-19.46,;12.89,-20.23,;15.55,-20.23,;16.88,-19.47,;18.22,-20.24,;18.21,-21.78,;16.88,-22.54,;16.87,-24.07,;18.19,-24.86,;19.53,-24.09,;19.54,-22.55,;18.18,-26.39,;16.85,-27.16,;15.52,-26.38,;19.57,-19.47,;20.9,-20.24,)|
Show InChI InChI=1S/C21H24FN5O4/c1-11-15-8-16(12-7-17(22)19(30-2)24-9-12)20(29)27(18(15)26-21(23)25-11)13-3-5-14(6-4-13)31-10-28/h7-9,13-14,28H,3-6,10H2,1-2H3,(H2,23,25,26)/t13-,14-
0.654n/an/an/an/an/an/an/an/a
Pfizer Inc.
Curated by ChEMBL
Assay Description
Inhibition of mouse PI3Kalpha
Bioorg Med Chem Lett 23: 2787-92 (2013)
Article DOI: 10.1016/j.bmcl.2013.02.020
BindingDB Entry DOI: 10.7270/Q2NZ890X
Serine/threonine-protein kinase mTOR
(Homo sapiens (Human))
BDBM50433050
(CHEMBL2375968)
Show SMILES COc1ncc(cc1F)-c1cc2c(C)nc(N)nc2n([C@H]2CC[C@@H](CC2)OCO)c1=O |r,wU:23.28,wD:20.21,(26.25,-15.63,;24.91,-14.86,;23.58,-15.63,;23.58,-17.17,;22.24,-17.93,;20.91,-17.16,;20.91,-15.63,;22.24,-14.86,;22.24,-13.32,;19.57,-17.92,;18.23,-17.13,;16.89,-17.91,;15.55,-17.15,;15.55,-15.61,;14.22,-17.92,;14.22,-19.46,;12.89,-20.23,;15.55,-20.23,;16.88,-19.47,;18.22,-20.24,;18.21,-21.78,;16.88,-22.54,;16.87,-24.07,;18.19,-24.86,;19.53,-24.09,;19.54,-22.55,;18.18,-26.39,;16.85,-27.16,;15.52,-26.38,;19.57,-19.47,;20.9,-20.24,)|
Show InChI InChI=1S/C21H24FN5O4/c1-11-15-8-16(12-7-17(22)19(30-2)24-9-12)20(29)27(18(15)26-21(23)25-11)13-3-5-14(6-4-13)31-10-28/h7-9,13-14,28H,3-6,10H2,1-2H3,(H2,23,25,26)/t13-,14-
NCI pathway
Reactome pathway
24n/an/an/an/an/an/an/an/a
Pfizer Inc.
Curated by ChEMBL
Assay Description
Inhibition of mTOR (unknown origin)
Bioorg Med Chem Lett 23: 2787-92 (2013)
Article DOI: 10.1016/j.bmcl.2013.02.020
BindingDB Entry DOI: 10.7270/Q2NZ890X
RAC-alpha serine/threonine-protein kinase
(Homo sapiens (Human))
BDBM50433050
(CHEMBL2375968)
Show SMILES COc1ncc(cc1F)-c1cc2c(C)nc(N)nc2n([C@H]2CC[C@@H](CC2)OCO)c1=O |r,wU:23.28,wD:20.21,(26.25,-15.63,;24.91,-14.86,;23.58,-15.63,;23.58,-17.17,;22.24,-17.93,;20.91,-17.16,;20.91,-15.63,;22.24,-14.86,;22.24,-13.32,;19.57,-17.92,;18.23,-17.13,;16.89,-17.91,;15.55,-17.15,;15.55,-15.61,;14.22,-17.92,;14.22,-19.46,;12.89,-20.23,;15.55,-20.23,;16.88,-19.47,;18.22,-20.24,;18.21,-21.78,;16.88,-22.54,;16.87,-24.07,;18.19,-24.86,;19.53,-24.09,;19.54,-22.55,;18.18,-26.39,;16.85,-27.16,;15.52,-26.38,;19.57,-19.47,;20.9,-20.24,)|
Show InChI InChI=1S/C21H24FN5O4/c1-11-15-8-16(12-7-17(22)19(30-2)24-9-12)20(29)27(18(15)26-21(23)25-11)13-3-5-14(6-4-13)31-10-28/h7-9,13-14,28H,3-6,10H2,1-2H3,(H2,23,25,26)/t13-,14-
n/an/a 5.20n/an/an/an/an/an/a
Pfizer Inc.
Curated by ChEMBL
Assay Description
Inhibition of AKT phosphorylation at Ser 473 in human BT20 cells
Bioorg Med Chem Lett 23: 2787-92 (2013)
Article DOI: 10.1016/j.bmcl.2013.02.020
BindingDB Entry DOI: 10.7270/Q2NZ890X