BDBM50433234 CHEMBL2375892
SMILES: COc1ccc(cc1Nc1nccc(n1)-c1cccnc1)C(=O)Nc1cccc(F)c1
InChI Key: InChIKey=KOGBNTSOPZVMIK-UHFFFAOYSA-N
Data: 1 IC50
Activity Spreadsheet -- Enzyme Inhibition Constant Data from BindingDB
Found 1 hit for monomerid = 50433234
Trg + Lig
Ki
nM
ΔG°
kcal/mole
IC50
nM
Kd
nM
EC50/IC50
nM
koff
s-1
kon
M-1s-1
pHTemp
°C
Bcr-Abl
(Homo sapiens (Human))
BDBM50433234
(CHEMBL2375892)
Show SMILES COc1ccc(cc1Nc1nccc(n1)-c1cccnc1)C(=O)Nc1cccc(F)c1
Show InChI InChI=1S/C23H18FN5O2/c1-31-21-8-7-15(22(30)27-18-6-2-5-17(24)13-18)12-20(21)29-23-26-11-9-19(28-23)16-4-3-10-25-14-16/h2-14H,1H3,(H,27,30)(H,26,28,29)
NCI pathway
Reactome pathway
n/an/a 3.20n/an/an/an/an/an/a
Xi'an Jiaotong University
Curated by ChEMBL
Assay Description
Inhibition of Bcr-Abl kinase (unknown origin) after 30 mins by HTRF assay
Bioorg Med Chem 21: 2527-34 (2013)
Article DOI: 10.1016/j.bmc.2013.02.036
BindingDB Entry DOI: 10.7270/Q2VH5Q6T