BDBM50433374 CHEMBL2375610
SMILES: CC(=O)Nc1ncc(CC(=O)N2CCN(CC2)c2cc(nc3ccccc23)-c2ccccn2)s1
InChI Key: InChIKey=AFTGNLNWBPWQIX-UHFFFAOYSA-N
Data: 3 EC50
Activity Spreadsheet -- Enzyme Inhibition Constant Data from BindingDB
Found 3 hits for monomerid = 50433374
Trg + Lig
Ki
nM
ΔG°
kcal/mole
IC50
nM
Kd
nM
EC50/IC50
nM
koff
s-1
kon
M-1s-1
pHTemp
°C
Methionine aminopeptidase 2
(Homo sapiens (Human))
BDBM50433374
(CHEMBL2375610)
Show SMILES CC(=O)Nc1ncc(CC(=O)N2CCN(CC2)c2cc(nc3ccccc23)-c2ccccn2)s1
Show InChI InChI=1S/C25H24N6O2S/c1-17(32)28-25-27-16-18(34-25)14-24(33)31-12-10-30(11-13-31)23-15-22(21-8-4-5-9-26-21)29-20-7-3-2-6-19(20)23/h2-9,15-16H,10-14H2,1H3,(H,27,28,32)
Reactome pathway
n/an/an/an/a>1.00E+5n/an/an/an/a
Johns Hopkins University School of Medicine
Curated by ChEMBL
Assay Description
Inhibition of human methionine aminopeptidase 2 in presence of Mn2+
J Med Chem 56: 3996-4016 (2013)
Article DOI: 10.1021/jm400227z
BindingDB Entry DOI: 10.7270/Q2SJ1N1Z
Methionine Aminopeptidase Type 1 (MetAP1)
(Homo sapiens (Human))
BDBM50433374
(CHEMBL2375610)
Show SMILES CC(=O)Nc1ncc(CC(=O)N2CCN(CC2)c2cc(nc3ccccc23)-c2ccccn2)s1
Show InChI InChI=1S/C25H24N6O2S/c1-17(32)28-25-27-16-18(34-25)14-24(33)31-12-10-30(11-13-31)23-15-22(21-8-4-5-9-26-21)29-20-7-3-2-6-19(20)23/h2-9,15-16H,10-14H2,1H3,(H,27,28,32)
Reactome pathway
n/an/an/an/a 4.80E+3n/an/an/an/a
Johns Hopkins University School of Medicine
Curated by ChEMBL
Assay Description
Inhibition of human methionine aminopeptidase 1 in presence of Mn2+
J Med Chem 56: 3996-4016 (2013)
Article DOI: 10.1021/jm400227z
BindingDB Entry DOI: 10.7270/Q2SJ1N1Z
Methionine Aminopeptidase Type 1 (MetAP1)
(Homo sapiens (Human))
BDBM50433374
(CHEMBL2375610)
Show SMILES CC(=O)Nc1ncc(CC(=O)N2CCN(CC2)c2cc(nc3ccccc23)-c2ccccn2)s1
Show InChI InChI=1S/C25H24N6O2S/c1-17(32)28-25-27-16-18(34-25)14-24(33)31-12-10-30(11-13-31)23-15-22(21-8-4-5-9-26-21)29-20-7-3-2-6-19(20)23/h2-9,15-16H,10-14H2,1H3,(H,27,28,32)
Reactome pathway
n/an/an/an/a 120n/an/an/an/a
Johns Hopkins University School of Medicine
Curated by ChEMBL
Assay Description
Inhibition of human methionine aminopeptidase 1 in presence of Co2+
J Med Chem 56: 3996-4016 (2013)
Article DOI: 10.1021/jm400227z
BindingDB Entry DOI: 10.7270/Q2SJ1N1Z