BDBM50433383 CHEMBL2375614
SMILES: C1CCN(CC1)c1cc(nc2ccccc12)-c1ccccn1
InChI Key: InChIKey=USOJNBCSEBSXNR-UHFFFAOYSA-N
Data: 3 EC50
Activity Spreadsheet -- Enzyme Inhibition Constant Data from BindingDB
Found 3 hits for monomerid = 50433383
Trg + Lig
Ki
nM
ΔG°
kcal/mole
IC50
nM
Kd
nM
EC50/IC50
nM
koff
s-1
kon
M-1s-1
pHTemp
°C
Methionine Aminopeptidase Type 1 (MetAP1)
(Homo sapiens (Human))
BDBM50433383
(CHEMBL2375614)
Show SMILES C1CCN(CC1)c1cc(nc2ccccc12)-c1ccccn1
Show InChI InChI=1S/C19H19N3/c1-6-12-22(13-7-1)19-14-18(17-10-4-5-11-20-17)21-16-9-3-2-8-15(16)19/h2-5,8-11,14H,1,6-7,12-13H2
Reactome pathway
n/an/an/an/a 390n/an/an/an/a
Johns Hopkins University School of Medicine
Curated by ChEMBL
Assay Description
Inhibition of human methionine aminopeptidase 1 in presence of Co2+
J Med Chem 56: 3996-4016 (2013)
Article DOI: 10.1021/jm400227z
BindingDB Entry DOI: 10.7270/Q2SJ1N1Z
Methionine aminopeptidase 2
(Homo sapiens (Human))
BDBM50433383
(CHEMBL2375614)
Show SMILES C1CCN(CC1)c1cc(nc2ccccc12)-c1ccccn1
Show InChI InChI=1S/C19H19N3/c1-6-12-22(13-7-1)19-14-18(17-10-4-5-11-20-17)21-16-9-3-2-8-15(16)19/h2-5,8-11,14H,1,6-7,12-13H2
Reactome pathway
n/an/an/an/a>1.00E+5n/an/an/an/a
Johns Hopkins University School of Medicine
Curated by ChEMBL
Assay Description
Inhibition of human methionine aminopeptidase 2 in presence of Mn2+
J Med Chem 56: 3996-4016 (2013)
Article DOI: 10.1021/jm400227z
BindingDB Entry DOI: 10.7270/Q2SJ1N1Z
Methionine Aminopeptidase Type 1 (MetAP1)
(Homo sapiens (Human))
BDBM50433383
(CHEMBL2375614)
Show SMILES C1CCN(CC1)c1cc(nc2ccccc12)-c1ccccn1
Show InChI InChI=1S/C19H19N3/c1-6-12-22(13-7-1)19-14-18(17-10-4-5-11-20-17)21-16-9-3-2-8-15(16)19/h2-5,8-11,14H,1,6-7,12-13H2
Reactome pathway
n/an/an/an/a>1.00E+5n/an/an/an/a
Johns Hopkins University School of Medicine
Curated by ChEMBL
Assay Description
Inhibition of human methionine aminopeptidase 1 in presence of Mn2+
J Med Chem 56: 3996-4016 (2013)
Article DOI: 10.1021/jm400227z
BindingDB Entry DOI: 10.7270/Q2SJ1N1Z