BDBM50433474 CHEMBL2381068
SMILES: Fc1ccccc1COC(=O)NCCCCCCc1ccccc1
InChI Key: InChIKey=WQFNTNZUECBLPM-UHFFFAOYSA-N
Data: 1 IC50
Activity Spreadsheet -- Enzyme Inhibition Constant Data from BindingDB
Found 1 hit for monomerid = 50433474
Trg + Lig
Ki
nM
ΔG°
kcal/mole
IC50
nM
Kd
nM
EC50/IC50
nM
koff
s-1
kon
M-1s-1
pHTemp
°C
Endothelial lipase (EL)
(Mus musculus (Mouse))
BDBM50433474
(CHEMBL2381068)
Show SMILES Fc1ccccc1COC(=O)NCCCCCCc1ccccc1
Show InChI InChI=1S/C20H24FNO2/c21-19-14-8-7-13-18(19)16-24-20(23)22-15-9-2-1-4-10-17-11-5-3-6-12-17/h3,5-8,11-14H,1-2,4,9-10,15-16H2,(H,22,23)
n/an/a>3.30E+4n/an/an/an/an/an/a
Janssen Research and Development, LLC
Curated by ChEMBL
Assay Description
Inhibition of mouse EL expressed in HEK293 cells using PED-A1 as substrate by spectrophotometry
Bioorg Med Chem Lett 23: 2595-7 (2013)
Article DOI: 10.1016/j.bmcl.2013.02.113
BindingDB Entry DOI: 10.7270/Q24T6KQV