null
SMILES: O=C(Nc1cnccc1N1CCNCC1)c1csc(n1)N1Cc2ccccc2C1=O
InChI Key: InChIKey=AGTFRKAFDLLYOF-UHFFFAOYSA-N
Activity Spreadsheet -- Enzyme Inhibition Constant Data from BindingDB
Found 2 hits for monomerid = 50433481
Trg + Lig
Ki
nM
ΔG°
kcal/mole
IC50
nM
Kd
nM
EC50/IC50
nM
koff
s-1
kon
M-1s-1
pHTemp
°C
Serine/threonine-protein kinase Chk1
(Homo sapiens (Human))
BDBM50433481
(CHEMBL2381115)
Show SMILES O=C(Nc1cnccc1N1CCNCC1)c1csc(n1)N1Cc2ccccc2C1=O
Show InChI InChI=1S/C21H20N6O2S/c28-19(24-16-11-23-6-5-18(16)26-9-7-22-8-10-26)17-13-30-21(25-17)27-12-14-3-1-2-4-15(14)20(27)29/h1-6,11,13,22H,7-10,12H2,(H,24,28)
Reactome pathway
n/an/a 2n/an/an/an/an/an/a
Merck Research Laboratories
Curated by ChEMBL
Assay Description
Inhibition of recombinant His-tagged CHK1 (unknown origin) expressed in baculovirus expression system using biotin-RSGLYRSPSMPENLNRPR as substrate af...
Bioorg Med Chem Lett 23: 2590-4 (2013)
Article DOI: 10.1016/j.bmcl.2013.02.108
BindingDB Entry DOI: 10.7270/Q2125V19
Serine/threonine-protein kinase Chk1
(Homo sapiens (Human))
BDBM50433481
(CHEMBL2381115)
Show SMILES O=C(Nc1cnccc1N1CCNCC1)c1csc(n1)N1Cc2ccccc2C1=O
Show InChI InChI=1S/C21H20N6O2S/c28-19(24-16-11-23-6-5-18(16)26-9-7-22-8-10-26)17-13-30-21(25-17)27-12-14-3-1-2-4-15(14)20(27)29/h1-6,11,13,22H,7-10,12H2,(H,24,28)
Reactome pathway
n/an/an/an/a 100n/an/an/an/a
Merck Research Laboratories
Curated by ChEMBL
Assay Description
Inhibition of CHK1 in human U2OS cells assessed as phosphorylation of H2AX after 2 hrs by FITC/propidium iodide staining-based immunofluorescence ass...
Bioorg Med Chem Lett 23: 2590-4 (2013)
Article DOI: 10.1016/j.bmcl.2013.02.108
BindingDB Entry DOI: 10.7270/Q2125V19