BDBM50433539 CHEMBL2381277
SMILES: CC(C)n1ncnc1-c1nc-2c(CCOc3cc(ccc-23)C2CN(C2)C(=O)CO)s1
InChI Key: InChIKey=VSWRDKQCEURVSQ-UHFFFAOYSA-N
Data: 1 KI  2 IC50
Activity Spreadsheet -- Enzyme Inhibition Constant Data from BindingDB
Found 3 hits for monomerid = 50433539
Trg + Lig
Ki
nM
ΔG°
kcal/mole
IC50
nM
Kd
nM
EC50/IC50
nM
koff
s-1
kon
M-1s-1
pHTemp
°C
Phosphatidylinositol 4,5-bisphosphate 3-kinase catalytic subunit alpha isoform
(Homo sapiens (Human))
BDBM50433539
(CHEMBL2381277)
Show SMILES CC(C)n1ncnc1-c1nc-2c(CCOc3cc(ccc-23)C2CN(C2)C(=O)CO)s1
Show InChI InChI=1S/C21H23N5O3S/c1-12(2)26-20(22-11-23-26)21-24-19-15-4-3-13(14-8-25(9-14)18(28)10-27)7-16(15)29-6-5-17(19)30-21/h3-4,7,11-12,14,27H,5-6,8-10H2,1-2H3
NCI pathway
Reactome pathway
0.610n/an/an/an/an/an/an/an/a
Genentech, Inc.
Curated by ChEMBL
Assay Description
Inhibition of GST-fused human recombinant PI3Kalpha expressed in baculovirus infected SF9 cells after 1 hr by scintillation proximity assay in presen...
Bioorg Med Chem Lett 23: 2606-13 (2013)
Article DOI: 10.1016/j.bmcl.2013.02.102
BindingDB Entry DOI: 10.7270/Q2W95BKF
Phosphatidylinositol 4,5-bisphosphate 3-kinase catalytic subunit beta isoform
(Homo sapiens (Human))
BDBM50433539
(CHEMBL2381277)
Show SMILES CC(C)n1ncnc1-c1nc-2c(CCOc3cc(ccc-23)C2CN(C2)C(=O)CO)s1
Show InChI InChI=1S/C21H23N5O3S/c1-12(2)26-20(22-11-23-26)21-24-19-15-4-3-13(14-8-25(9-14)18(28)10-27)7-16(15)29-6-5-17(19)30-21/h3-4,7,11-12,14,27H,5-6,8-10H2,1-2H3
NCI pathway
Reactome pathway
n/an/a 7.60n/an/an/an/an/an/a
Genentech, Inc.
Curated by ChEMBL
Assay Description
Inhibition of GST-fused human recombinant PI3Kbeta expressed in baculovirus infected SF9 cells after 1 hr by scintillation proximity assay in presenc...
Bioorg Med Chem Lett 23: 2606-13 (2013)
Article DOI: 10.1016/j.bmcl.2013.02.102
BindingDB Entry DOI: 10.7270/Q2W95BKF
Phosphatidylinositol 4,5-bisphosphate 3-kinase catalytic subunit alpha isoform
(Homo sapiens (Human))
BDBM50433539
(CHEMBL2381277)
Show SMILES CC(C)n1ncnc1-c1nc-2c(CCOc3cc(ccc-23)C2CN(C2)C(=O)CO)s1
Show InChI InChI=1S/C21H23N5O3S/c1-12(2)26-20(22-11-23-26)21-24-19-15-4-3-13(14-8-25(9-14)18(28)10-27)7-16(15)29-6-5-17(19)30-21/h3-4,7,11-12,14,27H,5-6,8-10H2,1-2H3
NCI pathway
Reactome pathway
n/an/a 67n/an/an/an/an/an/a
Genentech, Inc.
Curated by ChEMBL
Assay Description
Inhibition of PI3Kalpha in human PC3 cells assessed as inhibition of AKT phosphorylation at Ser473 after 2 hrs by ELISA
Bioorg Med Chem Lett 23: 2606-13 (2013)
Article DOI: 10.1016/j.bmcl.2013.02.102
BindingDB Entry DOI: 10.7270/Q2W95BKF