BDBM50433543 CHEMBL2381273
SMILES: CC(C)n1ncnc1-c1nc-2c(CCOc3cc(ccc-23)-c2ccc(N)nc2)s1
InChI Key: InChIKey=YHJVHNRIYHRCFY-UHFFFAOYSA-N
Data: 5 IC50
Activity Spreadsheet -- Enzyme Inhibition Constant Data from BindingDB
Found 5 hits for monomerid = 50433543
Trg + Lig
Ki
nM
ΔG°
kcal/mole
IC50
nM
Kd
nM
EC50/IC50
nM
koff
s-1
kon
M-1s-1
pHTemp
°C
Phosphatidylinositol 4,5-bisphosphate 3-kinase catalytic subunit alpha isoform
(Homo sapiens (Human))
BDBM50433543
(CHEMBL2381273)
Show SMILES CC(C)n1ncnc1-c1nc-2c(CCOc3cc(ccc-23)-c2ccc(N)nc2)s1
Show InChI InChI=1S/C21H20N6OS/c1-12(2)27-20(24-11-25-27)21-26-19-15-5-3-13(14-4-6-18(22)23-10-14)9-16(15)28-8-7-17(19)29-21/h3-6,9-12H,7-8H2,1-2H3,(H2,22,23)
NCI pathway
Reactome pathway
n/an/a 1.40n/an/an/an/an/an/a
Genentech, Inc.
Curated by ChEMBL
Assay Description
Inhibition of GST-fused human recombinant PI3Kalpha expressed in baculovirus infected SF9 cells after 1 hr by scintillation proximity assay in presen...
Bioorg Med Chem Lett 23: 2606-13 (2013)
Article DOI: 10.1016/j.bmcl.2013.02.102
BindingDB Entry DOI: 10.7270/Q2W95BKF
Phosphatidylinositol 4,5-bisphosphate 3-kinase catalytic subunit alpha isoform
(Homo sapiens (Human))
BDBM50433543
(CHEMBL2381273)
Show SMILES CC(C)n1ncnc1-c1nc-2c(CCOc3cc(ccc-23)-c2ccc(N)nc2)s1
Show InChI InChI=1S/C21H20N6OS/c1-12(2)27-20(24-11-25-27)21-26-19-15-5-3-13(14-4-6-18(22)23-10-14)9-16(15)28-8-7-17(19)29-21/h3-6,9-12H,7-8H2,1-2H3,(H2,22,23)
NCI pathway
Reactome pathway
n/an/a 71n/an/an/an/an/an/a
Genentech, Inc.
Curated by ChEMBL
Assay Description
Inhibition of PI3Kalpha in human PC3 cells assessed as inhibition of AKT phosphorylation at Ser473 after 2 hrs by ELISA
Bioorg Med Chem Lett 23: 2606-13 (2013)
Article DOI: 10.1016/j.bmcl.2013.02.102
BindingDB Entry DOI: 10.7270/Q2W95BKF
Phosphatidylinositol 4,5-bisphosphate 3-kinase catalytic subunit delta isoform
(Homo sapiens (Human))
BDBM50433543
(CHEMBL2381273)
Show SMILES CC(C)n1ncnc1-c1nc-2c(CCOc3cc(ccc-23)-c2ccc(N)nc2)s1
Show InChI InChI=1S/C21H20N6OS/c1-12(2)27-20(24-11-25-27)21-26-19-15-5-3-13(14-4-6-18(22)23-10-14)9-16(15)28-8-7-17(19)29-21/h3-6,9-12H,7-8H2,1-2H3,(H2,22,23)
NCI pathway
Reactome pathway
n/an/a 1.40n/an/an/an/an/an/a
Genentech, Inc.
Curated by ChEMBL
Assay Description
Inhibition of GST-fused human recombinant PI3Kdelta expressed in baculovirus infected SF9 cells after 1 hr by scintillation proximity assay in presen...
Bioorg Med Chem Lett 23: 2606-13 (2013)
Article DOI: 10.1016/j.bmcl.2013.02.102
BindingDB Entry DOI: 10.7270/Q2W95BKF
Phosphatidylinositol 4,5-bisphosphate 3-kinase catalytic subunit gamma isoform
(Homo sapiens (Human))
BDBM50433543
(CHEMBL2381273)
Show SMILES CC(C)n1ncnc1-c1nc-2c(CCOc3cc(ccc-23)-c2ccc(N)nc2)s1
Show InChI InChI=1S/C21H20N6OS/c1-12(2)27-20(24-11-25-27)21-26-19-15-5-3-13(14-4-6-18(22)23-10-14)9-16(15)28-8-7-17(19)29-21/h3-6,9-12H,7-8H2,1-2H3,(H2,22,23)
NCI pathway
Reactome pathway
n/an/a 3.70n/an/an/an/an/an/a
Genentech, Inc.
Curated by ChEMBL
Assay Description
Inhibition of GST-fused human recombinant PI3Kgamma expressed in baculovirus infected SF9 cells after 1 hr by scintillation proximity assay in presen...
Bioorg Med Chem Lett 23: 2606-13 (2013)
Article DOI: 10.1016/j.bmcl.2013.02.102
BindingDB Entry DOI: 10.7270/Q2W95BKF
Phosphatidylinositol 4,5-bisphosphate 3-kinase catalytic subunit beta isoform
(Homo sapiens (Human))
BDBM50433543
(CHEMBL2381273)
Show SMILES CC(C)n1ncnc1-c1nc-2c(CCOc3cc(ccc-23)-c2ccc(N)nc2)s1
Show InChI InChI=1S/C21H20N6OS/c1-12(2)27-20(24-11-25-27)21-26-19-15-5-3-13(14-4-6-18(22)23-10-14)9-16(15)28-8-7-17(19)29-21/h3-6,9-12H,7-8H2,1-2H3,(H2,22,23)
NCI pathway
Reactome pathway
n/an/a 13n/an/an/an/an/an/a
Genentech, Inc.
Curated by ChEMBL
Assay Description
Inhibition of GST-fused human recombinant PI3Kbeta expressed in baculovirus infected SF9 cells after 1 hr by scintillation proximity assay in presenc...
Bioorg Med Chem Lett 23: 2606-13 (2013)
Article DOI: 10.1016/j.bmcl.2013.02.102
BindingDB Entry DOI: 10.7270/Q2W95BKF