BDBM50433650 CHEMBL2380841
SMILES: Nc1ccnc2[nH]c(=O)c3ccccc3c12
InChI Key: InChIKey=CHZAQVIQFADGJA-UHFFFAOYSA-N
Data: 1 IC50
Activity Spreadsheet -- Enzyme Inhibition Constant Data from BindingDB
Found 1 hit for monomerid = 50433650
Trg + Lig
Ki
nM
ΔG°
kcal/mole
IC50
nM
Kd
nM
EC50/IC50
nM
koff
s-1
kon
M-1s-1
pHTemp
°C
Aurora kinase A
(Homo sapiens (Human))
BDBM50433650
(CHEMBL2380841)
Show SMILES Nc1ccnc2[nH]c(=O)c3ccccc3c12
Show InChI InChI=1S/C12H9N3O/c13-9-5-6-14-11-10(9)7-3-1-2-4-8(7)12(16)15-11/h1-6H,(H3,13,14,15,16)
NCI pathway
Reactome pathway
n/an/a 3.01E+3n/an/an/an/an/an/a
EMD Serono Research Institute, Inc.
Curated by ChEMBL
Assay Description
Inhibition of aurora-A (unknown origin)
Bioorg Med Chem Lett 23: 3081-7 (2013)
Article DOI: 10.1016/j.bmcl.2013.03.008
BindingDB Entry DOI: 10.7270/Q2QN686Z