BDBM50433654 CHEMBL2380836
SMILES: Fc1cc(ccc1C(=O)Nc1ccc(Nc2ccnc3[nH]c(=O)c4ccccc4c23)cc1)C(F)(F)F
InChI Key: InChIKey=ATLTVHRPWMFWKI-UHFFFAOYSA-N
Data: 1 IC50
Activity Spreadsheet -- Enzyme Inhibition Constant Data from BindingDB
Found 1 hit for monomerid = 50433654
Trg + Lig
Ki
nM
ΔG°
kcal/mole
IC50
nM
Kd
nM
EC50/IC50
nM
koff
s-1
kon
M-1s-1
pHTemp
°C
Aurora kinase A
(Homo sapiens (Human))
BDBM50433654
(CHEMBL2380836)
Show SMILES Fc1cc(ccc1C(=O)Nc1ccc(Nc2ccnc3[nH]c(=O)c4ccccc4c23)cc1)C(F)(F)F
Show InChI InChI=1S/C26H16F4N4O2/c27-20-13-14(26(28,29)30)5-10-19(20)25(36)33-16-8-6-15(7-9-16)32-21-11-12-31-23-22(21)17-3-1-2-4-18(17)24(35)34-23/h1-13H,(H,33,36)(H2,31,32,34,35)
NCI pathway
Reactome pathway
n/an/a 9n/an/an/an/an/an/a
EMD Serono Research Institute, Inc.
Curated by ChEMBL
Assay Description
Inhibition of aurora-A (unknown origin)
Bioorg Med Chem Lett 23: 3081-7 (2013)
Article DOI: 10.1016/j.bmcl.2013.03.008
BindingDB Entry DOI: 10.7270/Q2QN686Z