null
SMILES: CCc1ccc(NC(=O)CSc2nc3ccccc3c(=O)n2CCCC(=O)NCN2CCOCC2)cc1
InChI Key: InChIKey=XRPSHNJTZWAKDL-UHFFFAOYSA-N
Activity Spreadsheet -- Enzyme Inhibition Constant Data from BindingDB
Found 1 hit for monomerid = 50434067
Trg + Lig
Ki
nM
ΔG°
kcal/mole
IC50
nM
Kd
nM
EC50/IC50
nM
koff
s-1
kon
M-1s-1
pHTemp
°C
Atypical chemokine receptor 3
(Homo sapiens (Human))
BDBM50434067
(CHEMBL2381330)
Show SMILES CCc1ccc(NC(=O)CSc2nc3ccccc3c(=O)n2CCCC(=O)NCN2CCOCC2)cc1
Show InChI InChI=1S/C27H33N5O4S/c1-2-20-9-11-21(12-10-20)29-25(34)18-37-27-30-23-7-4-3-6-22(23)26(35)32(27)13-5-8-24(33)28-19-31-14-16-36-17-15-31/h3-4,6-7,9-12H,2,5,8,13-19H2,1H3,(H,28,33)(H,29,34)
n/an/a 4.74E+3n/an/an/an/an/an/a
PharmaDesign Inc.
Curated by ChEMBL
Assay Description
Binding affinity to CXCR7 (unknown origin)
J Med Chem 56: 4236-51 (2013)
Article DOI: 10.1021/jm400307y
BindingDB Entry DOI: 10.7270/Q2W66N54