BDBM50434093 CHEMBL2381353
SMILES: CC(C)c1cccc(c1)-n1cc(nn1)C(=O)c1ccccc1N
InChI Key: InChIKey=LGZMQEYZKUYTMM-UHFFFAOYSA-N
Data: 1 IC50
Activity Spreadsheet -- Enzyme Inhibition Constant Data from BindingDB
Found 1 hit for monomerid = 50434093
Trg + Lig
Ki
nM
ΔG°
kcal/mole
IC50
nM
Kd
nM
EC50/IC50
nM
koff
s-1
kon
M-1s-1
pHTemp
°C
Estrogen-related receptor alpha
(Homo sapiens (Human))
BDBM50434093
(CHEMBL2381353)
Show SMILES CC(C)c1cccc(c1)-n1cc(nn1)C(=O)c1ccccc1N
Show InChI InChI=1S/C18H18N4O/c1-12(2)13-6-5-7-14(10-13)22-11-17(20-21-22)18(23)15-8-3-4-9-16(15)19/h3-12H,19H2,1-2H3
Reactome pathway
n/an/a 21n/an/an/an/an/an/a
Chinese Academy of Sciences
Curated by ChEMBL
Assay Description
Inhibition of human GAL4-DBD-fused ERRalpha-LBD transcriptional activity transfected in human 293FT cells assessed as disruption of interaction with ...
J Med Chem 56: 4631-40 (2013)
Article DOI: 10.1021/jm4003928
BindingDB Entry DOI: 10.7270/Q2GX4CZW