BDBM50434284 CHEMBL2386349
SMILES: CCOc1cc(ccc1C1=N[C@@](C)(c2ccc(Cl)cc2)[C@](C)(N1C(=O)N1CCN(CC(=O)N2CCCC2)CC1)c1ccc(Cl)cc1)C(C)(C)C
InChI Key: InChIKey=DVHSHICVMASNND-IOLBBIBUSA-N
Data: 1 IC50
Activity Spreadsheet -- Enzyme Inhibition Constant Data from BindingDB
Found 1 hit for monomerid = 50434284
Trg + Lig
Ki
nM
ΔG°
kcal/mole
IC50
nM
Kd
nM
EC50/IC50
nM
koff
s-1
kon
M-1s-1
pHTemp
°C
E3 ubiquitin-protein ligase Mdm2
(Homo sapiens (Human))
BDBM50434284
(CHEMBL2386349)
Show SMILES CCOc1cc(ccc1C1=N[C@@](C)(c2ccc(Cl)cc2)[C@](C)(N1C(=O)N1CCN(CC(=O)N2CCCC2)CC1)c1ccc(Cl)cc1)C(C)(C)C |r,t:10|
Show InChI InChI=1S/C40H49Cl2N5O3/c1-7-50-34-26-30(38(2,3)4)14-19-33(34)36-43-39(5,28-10-15-31(41)16-11-28)40(6,29-12-17-32(42)18-13-29)47(36)37(49)46-24-22-44(23-25-46)27-35(48)45-20-8-9-21-45/h10-19,26H,7-9,20-25,27H2,1-6H3/t39-,40+/m0/s1
NCI pathway
Reactome pathway
n/an/a 14n/an/an/an/an/an/a
Roche Research Center
Curated by ChEMBL
Assay Description
Inhibition of N-terminal human recombinant MDM2 assessed as inhibition of protein interaction with p53 by HTRF assay
ACS Med Chem Lett 4: 466-9 (2013)
Article DOI: 10.1021/ml4000657
BindingDB Entry DOI: 10.7270/Q2JS9RTS