null
SMILES: Nc1ncnc2n(cc(C(=O)c3cccc(NC(=O)Nc4c(F)cccc4F)c3)c12)C1CCCC1
InChI Key: InChIKey=FAFWJMNGAWQHOH-UHFFFAOYSA-N
Activity Spreadsheet -- Enzyme Inhibition Constant Data from BindingDB
Found 1 hit for monomerid = 50434378
Trg + Lig
Ki
nM
ΔG°
kcal/mole
IC50
nM
Kd
nM
EC50/IC50
nM
koff
s-1
kon
M-1s-1
pHTemp
°C
Platelet-derived growth factor receptor beta
(Homo sapiens (Human))
BDBM50434378
(CHEMBL2386994)
Show SMILES Nc1ncnc2n(cc(C(=O)c3cccc(NC(=O)Nc4c(F)cccc4F)c3)c12)C1CCCC1
Show InChI InChI=1S/C25H22F2N6O2/c26-18-9-4-10-19(27)21(18)32-25(35)31-15-6-3-5-14(11-15)22(34)17-12-33(16-7-1-2-8-16)24-20(17)23(28)29-13-30-24/h3-6,9-13,16H,1-2,7-8H2,(H2,28,29,30)(H2,31,32,35)
NCI pathway
Reactome pathway
n/an/a>5.00E+3n/an/an/an/an/an/a
Pfizer Inc.
Curated by ChEMBL
Assay Description
Inhibition of PDGFR (unknown origin)
Bioorg Med Chem Lett 23: 3059-63 (2013)
Article DOI: 10.1016/j.bmcl.2013.03.012
BindingDB Entry DOI: 10.7270/Q24J0GGF