BDBM50434425 CHEMBL2387567
SMILES: CC[C@H](C[C@H](O)[C@@H](N)CN1CC(=O)N(CC1(C)C)c1ccccc1Cl)C(=O)N[C@H]1C2CC3CC1C[C@](O)(C3)C2
InChI Key: InChIKey=MGQQKSSUXHKDSK-AYYITOKJSA-N
Data: 2 IC50
Activity Spreadsheet -- Enzyme Inhibition Constant Data from BindingDB
Found 2 hits for monomerid = 50434425
Trg + Lig
Ki
nM
ΔG°
kcal/mole
IC50
nM
Kd
nM
EC50/IC50
nM
koff
s-1
kon
M-1s-1
pHTemp
°C
Renin
(Macaca fascicularis)
BDBM50434425
(CHEMBL2387567)
Show SMILES CC[C@H](C[C@H](O)[C@@H](N)CN1CC(=O)N(CC1(C)C)c1ccccc1Cl)C(=O)N[C@H]1C2CC3CC1C[C@](O)(C3)C2 |r,wU:4.4,2.2,28.29,wD:6.6,35.38,TLB:27:28:38.34.35:32.31.30,27:28:30:38.35.37,36:35:28:32.31.30,THB:34:33:30:38.35.37,34:35:28.33.32:30,37:35:28:32.31.30,37:31:28:38.34.35,(14.26,-52.83,;12.92,-53.6,;12.92,-55.14,;11.59,-55.9,;10.25,-55.13,;10.26,-53.59,;8.92,-55.9,;7.59,-55.13,;8.92,-57.44,;7.58,-58.21,;6.25,-57.44,;4.91,-58.21,;3.57,-57.44,;4.92,-59.75,;6.25,-60.52,;7.58,-59.75,;9.06,-60.14,;7.97,-61.23,;3.58,-60.53,;2.24,-59.76,;.92,-60.53,;.91,-62.08,;2.25,-62.85,;3.58,-62.08,;4.92,-62.85,;14.25,-55.91,;14.25,-57.45,;15.59,-55.14,;16.92,-55.91,;18.12,-54.64,;18.11,-53.15,;19.46,-52.67,;18.42,-53.9,;18.42,-55.49,;19.83,-56.06,;20.84,-54.78,;22.17,-55.55,;20.85,-53.25,;19.45,-55.13,)|
Show InChI InChI=1S/C30H45ClN4O4/c1-4-19(28(38)33-27-20-9-18-10-21(27)14-30(39,12-18)13-20)11-25(36)23(32)15-34-16-26(37)35(17-29(34,2)3)24-8-6-5-7-22(24)31/h5-8,18-21,23,25,27,36,39H,4,9-17,32H2,1-3H3,(H,33,38)/t18?,19-,20?,21?,23+,25+,27-,30-/m1/s1
n/an/a 6.30n/an/an/an/an/an/a
Daiichi Sankyo Co., Ltd
Curated by ChEMBL
Assay Description
Inhibition of renin in cynomolgus monkey plasma after 1 hr by RIA
Bioorg Med Chem 21: 3175-96 (2013)
Article DOI: 10.1016/j.bmc.2013.03.022
BindingDB Entry DOI: 10.7270/Q2GT5PJK
Renin
(Homo sapiens (Human))
BDBM50434425
(CHEMBL2387567)
Show SMILES CC[C@H](C[C@H](O)[C@@H](N)CN1CC(=O)N(CC1(C)C)c1ccccc1Cl)C(=O)N[C@H]1C2CC3CC1C[C@](O)(C3)C2 |r,wU:4.4,2.2,28.29,wD:6.6,35.38,TLB:27:28:38.34.35:32.31.30,27:28:30:38.35.37,36:35:28:32.31.30,THB:34:33:30:38.35.37,34:35:28.33.32:30,37:35:28:32.31.30,37:31:28:38.34.35,(14.26,-52.83,;12.92,-53.6,;12.92,-55.14,;11.59,-55.9,;10.25,-55.13,;10.26,-53.59,;8.92,-55.9,;7.59,-55.13,;8.92,-57.44,;7.58,-58.21,;6.25,-57.44,;4.91,-58.21,;3.57,-57.44,;4.92,-59.75,;6.25,-60.52,;7.58,-59.75,;9.06,-60.14,;7.97,-61.23,;3.58,-60.53,;2.24,-59.76,;.92,-60.53,;.91,-62.08,;2.25,-62.85,;3.58,-62.08,;4.92,-62.85,;14.25,-55.91,;14.25,-57.45,;15.59,-55.14,;16.92,-55.91,;18.12,-54.64,;18.11,-53.15,;19.46,-52.67,;18.42,-53.9,;18.42,-55.49,;19.83,-56.06,;20.84,-54.78,;22.17,-55.55,;20.85,-53.25,;19.45,-55.13,)|
Show InChI InChI=1S/C30H45ClN4O4/c1-4-19(28(38)33-27-20-9-18-10-21(27)14-30(39,12-18)13-20)11-25(36)23(32)15-34-16-26(37)35(17-29(34,2)3)24-8-6-5-7-22(24)31/h5-8,18-21,23,25,27,36,39H,4,9-17,32H2,1-3H3,(H,33,38)/t18?,19-,20?,21?,23+,25+,27-,30-/m1/s1
Reactome pathway
n/an/a 0.900n/an/an/an/an/an/a
Daiichi Sankyo Co., Ltd
Curated by ChEMBL
Assay Description
Inhibition of human recombinant renin using Arg-Glu(EDANS)-Ile-His-Pro-Phe-His-Leu-Val-Ile-His-Thr-Lys (DABCYL)-Arg as substrate incubated for 10 min...
Bioorg Med Chem 21: 3175-96 (2013)
Article DOI: 10.1016/j.bmc.2013.03.022
BindingDB Entry DOI: 10.7270/Q2GT5PJK