BDBM50434445 CHEMBL2387547
SMILES: CC(C)[C@H](C[C@H](O)[C@@H](N)CN1CC(=O)N(CC1(C)C)c1ccccc1Cl)C(=O)Nc1ccccn1
InChI Key: InChIKey=HXIYKPJHHVMGIL-VCOUNFBDSA-N
Data: 2 IC50
Activity Spreadsheet -- Enzyme Inhibition Constant Data from BindingDB
Found 2 hits for monomerid = 50434445
Trg + Lig
Ki
nM
ΔG°
kcal/mole
IC50
nM
Kd
nM
EC50/IC50
nM
koff
s-1
kon
M-1s-1
pHTemp
°C
Renin
(Macaca fascicularis)
BDBM50434445
(CHEMBL2387547)
Show SMILES CC(C)[C@H](C[C@H](O)[C@@H](N)CN1CC(=O)N(CC1(C)C)c1ccccc1Cl)C(=O)Nc1ccccn1 |r|
Show InChI InChI=1S/C26H36ClN5O3/c1-17(2)18(25(35)30-23-11-7-8-12-29-23)13-22(33)20(28)14-31-15-24(34)32(16-26(31,3)4)21-10-6-5-9-19(21)27/h5-12,17-18,20,22,33H,13-16,28H2,1-4H3,(H,29,30,35)/t18-,20-,22-/m0/s1
n/an/a 3.40n/an/an/an/an/an/a
Daiichi Sankyo Co., Ltd
Curated by ChEMBL
Assay Description
Inhibition of renin in cynomolgus monkey plasma after 1 hr by RIA
Bioorg Med Chem 21: 3175-96 (2013)
Article DOI: 10.1016/j.bmc.2013.03.022
BindingDB Entry DOI: 10.7270/Q2GT5PJK
Renin
(Homo sapiens (Human))
BDBM50434445
(CHEMBL2387547)
Show SMILES CC(C)[C@H](C[C@H](O)[C@@H](N)CN1CC(=O)N(CC1(C)C)c1ccccc1Cl)C(=O)Nc1ccccn1 |r|
Show InChI InChI=1S/C26H36ClN5O3/c1-17(2)18(25(35)30-23-11-7-8-12-29-23)13-22(33)20(28)14-31-15-24(34)32(16-26(31,3)4)21-10-6-5-9-19(21)27/h5-12,17-18,20,22,33H,13-16,28H2,1-4H3,(H,29,30,35)/t18-,20-,22-/m0/s1
Reactome pathway
n/an/a 1.80n/an/an/an/an/an/a
Daiichi Sankyo Co., Ltd
Curated by ChEMBL
Assay Description
Inhibition of human recombinant renin using Arg-Glu(EDANS)-Ile-His-Pro-Phe-His-Leu-Val-Ile-His-Thr-Lys (DABCYL)-Arg as substrate incubated for 10 min...
Bioorg Med Chem 21: 3175-96 (2013)
Article DOI: 10.1016/j.bmc.2013.03.022
BindingDB Entry DOI: 10.7270/Q2GT5PJK