BDBM50434505 CHEMBL2385531
SMILES: CN1c2ccc(cc2Cc2cc(oc2C1=O)-c1ccc(Cl)cc1)N1CCNCC1
InChI Key: InChIKey=SIJOROVRMMKDAO-UHFFFAOYSA-N
Data: 1 IC50
Activity Spreadsheet -- Enzyme Inhibition Constant Data from BindingDB
Found 1 hit for monomerid = 50434505
Trg + Lig
Ki
nM
ΔG°
kcal/mole
IC50
nM
Kd
nM
EC50/IC50
nM
koff
s-1
kon
M-1s-1
pHTemp
°C
MAP kinase-activated protein kinase 2
(Homo sapiens (Human))
BDBM50434505
(CHEMBL2385531)
Show SMILES CN1c2ccc(cc2Cc2cc(oc2C1=O)-c1ccc(Cl)cc1)N1CCNCC1
Show InChI InChI=1S/C23H22ClN3O2/c1-26-20-7-6-19(27-10-8-25-9-11-27)13-16(20)12-17-14-21(29-22(17)23(26)28)15-2-4-18(24)5-3-15/h2-7,13-14,25H,8-12H2,1H3
NCI pathway
Reactome pathway
n/an/a 79n/an/an/an/an/an/a
Merck Research Laboratories
Curated by ChEMBL
Assay Description
Inhibition of MK2 (unknown origin) phosphorylation using TAMRA labeled peptide as substrate incubated 30 mins before substrate addition measured afte...
Bioorg Med Chem Lett 23: 3262-6 (2013)
Article DOI: 10.1016/j.bmcl.2013.03.109
BindingDB Entry DOI: 10.7270/Q2ZS2XX8