BDBM50434609 CHEMBL2386808
SMILES: Cc1nc(Nc2cc(n[nH]2)-c2ccc(CNC(=O)Nc3cc(on3)C(C)(C)C)cc2)cc(n1)N1CCN(CCO)CC1
InChI Key: InChIKey=PJQVRCVOTATLHM-UHFFFAOYSA-N
Data: 2 IC50
Activity Spreadsheet -- Enzyme Inhibition Constant Data from BindingDB
Found 2 hits for monomerid = 50434609
Trg + Lig
Ki
nM
ΔG°
kcal/mole
IC50
nM
Kd
nM
EC50/IC50
nM
koff
s-1
kon
M-1s-1
pHTemp
°C
Aurora kinase A
(Homo sapiens (Human))
BDBM50434609
(CHEMBL2386808)
Show SMILES Cc1nc(Nc2cc(n[nH]2)-c2ccc(CNC(=O)Nc3cc(on3)C(C)(C)C)cc2)cc(n1)N1CCN(CCO)CC1
Show InChI InChI=1S/C29H38N10O3/c1-19-31-24(17-27(32-19)39-11-9-38(10-12-39)13-14-40)33-25-15-22(35-36-25)21-7-5-20(6-8-21)18-30-28(41)34-26-16-23(42-37-26)29(2,3)4/h5-8,15-17,40H,9-14,18H2,1-4H3,(H2,30,34,37,41)(H2,31,32,33,35,36)
NCI pathway
Reactome pathway
n/an/a 490n/an/an/an/an/an/a
National Health Research Institutes
Curated by ChEMBL
Assay Description
Inhibition of recombinant GST tagged Aurora A kinase (123 to 401) (unknown origin) transfected in insect sf9 cells after 90 mins by wallac counting a...
Bioorg Med Chem 21: 2856-67 (2013)
Article DOI: 10.1016/j.bmc.2013.03.083
BindingDB Entry DOI: 10.7270/Q22N53NF
Receptor-type tyrosine-protein kinase FLT3
(Homo sapiens (Human))
BDBM50434609
(CHEMBL2386808)
Show SMILES Cc1nc(Nc2cc(n[nH]2)-c2ccc(CNC(=O)Nc3cc(on3)C(C)(C)C)cc2)cc(n1)N1CCN(CCO)CC1
Show InChI InChI=1S/C29H38N10O3/c1-19-31-24(17-27(32-19)39-11-9-38(10-12-39)13-14-40)33-25-15-22(35-36-25)21-7-5-20(6-8-21)18-30-28(41)34-26-16-23(42-37-26)29(2,3)4/h5-8,15-17,40H,9-14,18H2,1-4H3,(H2,30,34,37,41)(H2,31,32,33,35,36)
n/an/a 95n/an/an/an/an/an/a
National Health Research Institutes
Curated by ChEMBL
Assay Description
Inhibition of wild type GST tagged FLT3 kinase (567 to 993) (unknown origin) transfected in insect sf9 cells after 4 hrs by wallac counting analysis
Bioorg Med Chem 21: 2856-67 (2013)
Article DOI: 10.1016/j.bmc.2013.03.083
BindingDB Entry DOI: 10.7270/Q22N53NF