BDBM50434615 CHEMBL2386802
SMILES: CC(C)(C)c1cc(NC(=O)NCc2ccc(cc2)-c2cc(NC(=O)c3ccc(OCCN4CCOCC4)cc3)[nH]n2)no1
InChI Key: InChIKey=GEDYWUPVBNHAFW-UHFFFAOYSA-N
Data: 2 IC50
Activity Spreadsheet -- Enzyme Inhibition Constant Data from BindingDB
Found 2 hits for monomerid = 50434615
Trg + Lig
Ki
nM
ΔG°
kcal/mole
IC50
nM
Kd
nM
EC50/IC50
nM
koff
s-1
kon
M-1s-1
pHTemp
°C
Aurora kinase A
(Homo sapiens (Human))
BDBM50434615
(CHEMBL2386802)
Show SMILES CC(C)(C)c1cc(NC(=O)NCc2ccc(cc2)-c2cc(NC(=O)c3ccc(OCCN4CCOCC4)cc3)[nH]n2)no1
Show InChI InChI=1S/C31H37N7O5/c1-31(2,3)26-19-28(37-43-26)34-30(40)32-20-21-4-6-22(7-5-21)25-18-27(36-35-25)33-29(39)23-8-10-24(11-9-23)42-17-14-38-12-15-41-16-13-38/h4-11,18-19H,12-17,20H2,1-3H3,(H2,32,34,37,40)(H2,33,35,36,39)
NCI pathway
Reactome pathway
n/an/a>1.00E+3n/an/an/an/an/an/a
National Health Research Institutes
Curated by ChEMBL
Assay Description
Inhibition of recombinant GST tagged Aurora A kinase (123 to 401) (unknown origin) transfected in insect sf9 cells after 90 mins by wallac counting a...
Bioorg Med Chem 21: 2856-67 (2013)
Article DOI: 10.1016/j.bmc.2013.03.083
BindingDB Entry DOI: 10.7270/Q22N53NF
Receptor-type tyrosine-protein kinase FLT3
(Homo sapiens (Human))
BDBM50434615
(CHEMBL2386802)
Show SMILES CC(C)(C)c1cc(NC(=O)NCc2ccc(cc2)-c2cc(NC(=O)c3ccc(OCCN4CCOCC4)cc3)[nH]n2)no1
Show InChI InChI=1S/C31H37N7O5/c1-31(2,3)26-19-28(37-43-26)34-30(40)32-20-21-4-6-22(7-5-21)25-18-27(36-35-25)33-29(39)23-8-10-24(11-9-23)42-17-14-38-12-15-41-16-13-38/h4-11,18-19H,12-17,20H2,1-3H3,(H2,32,34,37,40)(H2,33,35,36,39)
n/an/a 18n/an/an/an/an/an/a
National Health Research Institutes
Curated by ChEMBL
Assay Description
Inhibition of wild type GST tagged FLT3 kinase (567 to 993) (unknown origin) transfected in insect sf9 cells after 4 hrs by wallac counting analysis
Bioorg Med Chem 21: 2856-67 (2013)
Article DOI: 10.1016/j.bmc.2013.03.083
BindingDB Entry DOI: 10.7270/Q22N53NF