BDBM50434618 CHEMBL2386799
SMILES: Fc1ccc(NC(=O)NCc2ccc(cc2)-c2cc(NC(=O)c3ccc(OCCN4CCOCC4)cc3)[nH]n2)cc1
InChI Key: InChIKey=IIWNWGTVQWYQGV-UHFFFAOYSA-N
Data: 2 IC50
Activity Spreadsheet -- Enzyme Inhibition Constant Data from BindingDB
Found 2 hits for monomerid = 50434618
Trg + Lig
Ki
nM
ΔG°
kcal/mole
IC50
nM
Kd
nM
EC50/IC50
nM
koff
s-1
kon
M-1s-1
pHTemp
°C
Aurora kinase A
(Homo sapiens (Human))
BDBM50434618
(CHEMBL2386799)
Show SMILES Fc1ccc(NC(=O)NCc2ccc(cc2)-c2cc(NC(=O)c3ccc(OCCN4CCOCC4)cc3)[nH]n2)cc1
Show InChI InChI=1S/C30H31FN6O4/c31-24-7-9-25(10-8-24)33-30(39)32-20-21-1-3-22(4-2-21)27-19-28(36-35-27)34-29(38)23-5-11-26(12-6-23)41-18-15-37-13-16-40-17-14-37/h1-12,19H,13-18,20H2,(H2,32,33,39)(H2,34,35,36,38)
NCI pathway
Reactome pathway
n/an/a>1.00E+3n/an/an/an/an/an/a
National Health Research Institutes
Curated by ChEMBL
Assay Description
Inhibition of recombinant GST tagged Aurora A kinase (123 to 401) (unknown origin) transfected in insect sf9 cells after 90 mins by wallac counting a...
Bioorg Med Chem 21: 2856-67 (2013)
Article DOI: 10.1016/j.bmc.2013.03.083
BindingDB Entry DOI: 10.7270/Q22N53NF
Receptor-type tyrosine-protein kinase FLT3
(Homo sapiens (Human))
BDBM50434618
(CHEMBL2386799)
Show SMILES Fc1ccc(NC(=O)NCc2ccc(cc2)-c2cc(NC(=O)c3ccc(OCCN4CCOCC4)cc3)[nH]n2)cc1
Show InChI InChI=1S/C30H31FN6O4/c31-24-7-9-25(10-8-24)33-30(39)32-20-21-1-3-22(4-2-21)27-19-28(36-35-27)34-29(38)23-5-11-26(12-6-23)41-18-15-37-13-16-40-17-14-37/h1-12,19H,13-18,20H2,(H2,32,33,39)(H2,34,35,36,38)
n/an/a 66n/an/an/an/an/an/a
National Health Research Institutes
Curated by ChEMBL
Assay Description
Inhibition of wild type GST tagged FLT3 kinase (567 to 993) (unknown origin) transfected in insect sf9 cells after 4 hrs by wallac counting analysis
Bioorg Med Chem 21: 2856-67 (2013)
Article DOI: 10.1016/j.bmc.2013.03.083
BindingDB Entry DOI: 10.7270/Q22N53NF