BDBM50434645 CHEMBL2387194
SMILES: CC(C)[C@H]1CC[C@H](CC1)N1CCC(CC1)N1C(=O)C(C)c2ccccc12
InChI Key: InChIKey=UDIDJCCXFVDPEB-YQQQUEKLSA-N
Data: 1 KI  1 EC50
Activity Spreadsheet -- Enzyme Inhibition Constant Data from BindingDB
Found 2 hits for monomerid = 50434645
Trg + Lig
Ki
nM
ΔG°
kcal/mole
IC50
nM
Kd
nM
EC50/IC50
nM
koff
s-1
kon
M-1s-1
pHTemp
°C
Nociceptin receptor
(Homo sapiens (Human))
BDBM50434645
(CHEMBL2387194)
Show SMILES CC(C)[C@H]1CC[C@H](CC1)N1CCC(CC1)N1C(=O)C(C)c2ccccc12 |r,wU:6.9,3.2,(5.8,-45.06,;6.83,-43.93,;8.33,-44.25,;6.36,-42.46,;4.85,-42.14,;4.38,-40.67,;5.4,-39.52,;6.92,-39.84,;7.4,-41.32,;4.93,-38.06,;3.43,-37.73,;2.96,-36.27,;3.99,-35.13,;5.49,-35.45,;5.96,-36.92,;3.51,-33.67,;4.42,-32.42,;5.96,-32.41,;3.51,-31.16,;3.99,-29.7,;2.04,-31.64,;.71,-30.88,;-.63,-31.65,;-.62,-33.19,;.71,-33.96,;2.04,-33.19,)|
Show InChI InChI=1S/C23H34N2O/c1-16(2)18-8-10-19(11-9-18)24-14-12-20(13-15-24)25-22-7-5-4-6-21(22)17(3)23(25)26/h4-7,16-20H,8-15H2,1-3H3/t17?,18-,19+
Reactome pathway
6.5n/an/an/an/an/an/an/an/a
Astraea Therapeutics, LLC.
Curated by ChEMBL
Assay Description
Displacement of [3H] N/OFQ from human nociceptin receptor transfected in CHO cells
Bioorg Med Chem Lett 23: 3308-13 (2013)
Article DOI: 10.1016/j.bmcl.2013.03.101
BindingDB Entry DOI: 10.7270/Q2T43VHN
Nociceptin receptor
(Homo sapiens (Human))
BDBM50434645
(CHEMBL2387194)
Show SMILES CC(C)[C@H]1CC[C@H](CC1)N1CCC(CC1)N1C(=O)C(C)c2ccccc12 |r,wU:6.9,3.2,(5.8,-45.06,;6.83,-43.93,;8.33,-44.25,;6.36,-42.46,;4.85,-42.14,;4.38,-40.67,;5.4,-39.52,;6.92,-39.84,;7.4,-41.32,;4.93,-38.06,;3.43,-37.73,;2.96,-36.27,;3.99,-35.13,;5.49,-35.45,;5.96,-36.92,;3.51,-33.67,;4.42,-32.42,;5.96,-32.41,;3.51,-31.16,;3.99,-29.7,;2.04,-31.64,;.71,-30.88,;-.63,-31.65,;-.62,-33.19,;.71,-33.96,;2.04,-33.19,)|
Show InChI InChI=1S/C23H34N2O/c1-16(2)18-8-10-19(11-9-18)24-14-12-20(13-15-24)25-22-7-5-4-6-21(22)17(3)23(25)26/h4-7,16-20H,8-15H2,1-3H3/t17?,18-,19+
Reactome pathway
n/an/an/an/a 55n/an/an/an/a
Astraea Therapeutics, LLC.
Curated by ChEMBL
Assay Description
Agonist activity at human nociceptin receptor transfected in CHO cells assessed as stimulation of [35S]GTPgammaS binding by liquid scintillation coun...
Bioorg Med Chem Lett 23: 3308-13 (2013)
Article DOI: 10.1016/j.bmcl.2013.03.101
BindingDB Entry DOI: 10.7270/Q2T43VHN