BDBM50434685 CHEMBL2387599
SMILES: Clc1ccccc1-c1nc2c([nH]1)c(=O)[nH]c1cc(ccc21)-c1ccccc1
InChI Key: InChIKey=SJSIOPWZUMWNBI-UHFFFAOYSA-N
Data: 4 IC50
Activity Spreadsheet -- Enzyme Inhibition Constant Data from BindingDB
Found 4 hits for monomerid = 50434685
Trg + Lig
Ki
nM
ΔG°
kcal/mole
IC50
nM
Kd
nM
EC50/IC50
nM
koff
s-1
kon
M-1s-1
pHTemp
°C
Cytochrome P450 2D6
(Homo sapiens (Human))
BDBM50434685
(CHEMBL2387599)
Show SMILES Clc1ccccc1-c1nc2c([nH]1)c(=O)[nH]c1cc(ccc21)-c1ccccc1
Show InChI InChI=1S/C22H14ClN3O/c23-17-9-5-4-8-15(17)21-25-19-16-11-10-14(13-6-2-1-3-7-13)12-18(16)24-22(27)20(19)26-21/h1-12H,(H,24,27)(H,25,26)
n/an/a>3.00E+4n/an/an/an/an/an/a
Dainippon Sumitomo Pharma. Co. Ltd
Curated by ChEMBL
Assay Description
Inhibition of CYP2D6 in human liver microsomes after 10 mins by LC/MS/MS analysis
Bioorg Med Chem 21: 2868-78 (2013)
Article DOI: 10.1016/j.bmc.2013.03.069
BindingDB Entry DOI: 10.7270/Q2JM2C1J
Prostaglandin E synthase
(Homo sapiens (Human))
BDBM50434685
(CHEMBL2387599)
Show SMILES Clc1ccccc1-c1nc2c([nH]1)c(=O)[nH]c1cc(ccc21)-c1ccccc1
Show InChI InChI=1S/C22H14ClN3O/c23-17-9-5-4-8-15(17)21-25-19-16-11-10-14(13-6-2-1-3-7-13)12-18(16)24-22(27)20(19)26-21/h1-12H,(H,24,27)(H,25,26)
Reactome pathway
n/an/a 7.90n/an/an/an/an/an/a
Dainippon Sumitomo Pharma. Co. Ltd
Curated by ChEMBL
Assay Description
Inhibition of mPGES1 (unknown origin)-mediated PGE2 synthesis transfected in HEK293 cells coexpressing COX1 using arachidonic acid as substrate prein...
Bioorg Med Chem 21: 2868-78 (2013)
Article DOI: 10.1016/j.bmc.2013.03.069
BindingDB Entry DOI: 10.7270/Q2JM2C1J
Cytochrome P450 2C9
(Homo sapiens (Human))
BDBM50434685
(CHEMBL2387599)
Show SMILES Clc1ccccc1-c1nc2c([nH]1)c(=O)[nH]c1cc(ccc21)-c1ccccc1
Show InChI InChI=1S/C22H14ClN3O/c23-17-9-5-4-8-15(17)21-25-19-16-11-10-14(13-6-2-1-3-7-13)12-18(16)24-22(27)20(19)26-21/h1-12H,(H,24,27)(H,25,26)
Reactome pathway
n/an/a>3.00E+4n/an/an/an/an/an/a
Dainippon Sumitomo Pharma. Co. Ltd
Curated by ChEMBL
Assay Description
Inhibition of CYP2C9 in human liver microsomes after 10 mins by LC/MS/MS analysis
Bioorg Med Chem 21: 2868-78 (2013)
Article DOI: 10.1016/j.bmc.2013.03.069
BindingDB Entry DOI: 10.7270/Q2JM2C1J
Cytochrome P450 2C19
(Homo sapiens (Human))
BDBM50434685
(CHEMBL2387599)
Show SMILES Clc1ccccc1-c1nc2c([nH]1)c(=O)[nH]c1cc(ccc21)-c1ccccc1
Show InChI InChI=1S/C22H14ClN3O/c23-17-9-5-4-8-15(17)21-25-19-16-11-10-14(13-6-2-1-3-7-13)12-18(16)24-22(27)20(19)26-21/h1-12H,(H,24,27)(H,25,26)
Reactome pathway
n/an/a>3.00E+4n/an/an/an/an/an/a
Dainippon Sumitomo Pharma. Co. Ltd
Curated by ChEMBL
Assay Description
Inhibition of CYP2C19 in human liver microsomes after 10 mins by LC/MS/MS analysis
Bioorg Med Chem 21: 2868-78 (2013)
Article DOI: 10.1016/j.bmc.2013.03.069
BindingDB Entry DOI: 10.7270/Q2JM2C1J