BDBM50434690 CHEMBL2387594
SMILES: CCc1ccc2c3nc([nH]c3c(=O)[nH]c2c1)-c1ccccc1Cl
InChI Key: InChIKey=PXZRQATTWSLRPF-UHFFFAOYSA-N
Data: 4 IC50
Activity Spreadsheet -- Enzyme Inhibition Constant Data from BindingDB
Found 4 hits for monomerid = 50434690
Trg + Lig
Ki
nM
ΔG°
kcal/mole
IC50
nM
Kd
nM
EC50/IC50
nM
koff
s-1
kon
M-1s-1
pHTemp
°C
Cytochrome P450 2D6
(Homo sapiens (Human))
BDBM50434690
(CHEMBL2387594)
Show SMILES CCc1ccc2c3nc([nH]c3c(=O)[nH]c2c1)-c1ccccc1Cl
Show InChI InChI=1S/C18H14ClN3O/c1-2-10-7-8-12-14(9-10)20-18(23)16-15(12)21-17(22-16)11-5-3-4-6-13(11)19/h3-9H,2H2,1H3,(H,20,23)(H,21,22)
n/an/a>3.00E+4n/an/an/an/an/an/a
Dainippon Sumitomo Pharma. Co. Ltd
Curated by ChEMBL
Assay Description
Inhibition of CYP2D6 in human liver microsomes after 10 mins by LC/MS/MS analysis
Bioorg Med Chem 21: 2868-78 (2013)
Article DOI: 10.1016/j.bmc.2013.03.069
BindingDB Entry DOI: 10.7270/Q2JM2C1J
Prostaglandin E synthase
(Homo sapiens (Human))
BDBM50434690
(CHEMBL2387594)
Show SMILES CCc1ccc2c3nc([nH]c3c(=O)[nH]c2c1)-c1ccccc1Cl
Show InChI InChI=1S/C18H14ClN3O/c1-2-10-7-8-12-14(9-10)20-18(23)16-15(12)21-17(22-16)11-5-3-4-6-13(11)19/h3-9H,2H2,1H3,(H,20,23)(H,21,22)
Reactome pathway
n/an/a 98n/an/an/an/an/an/a
Dainippon Sumitomo Pharma. Co. Ltd
Curated by ChEMBL
Assay Description
Inhibition of mPGES1 (unknown origin)-mediated PGE2 synthesis transfected in HEK293 cells coexpressing COX1 using arachidonic acid as substrate prein...
Bioorg Med Chem 21: 2868-78 (2013)
Article DOI: 10.1016/j.bmc.2013.03.069
BindingDB Entry DOI: 10.7270/Q2JM2C1J
Cytochrome P450 2C9
(Homo sapiens (Human))
BDBM50434690
(CHEMBL2387594)
Show SMILES CCc1ccc2c3nc([nH]c3c(=O)[nH]c2c1)-c1ccccc1Cl
Show InChI InChI=1S/C18H14ClN3O/c1-2-10-7-8-12-14(9-10)20-18(23)16-15(12)21-17(22-16)11-5-3-4-6-13(11)19/h3-9H,2H2,1H3,(H,20,23)(H,21,22)
Reactome pathway
n/an/a 2.10E+4n/an/an/an/an/an/a
Dainippon Sumitomo Pharma. Co. Ltd
Curated by ChEMBL
Assay Description
Inhibition of CYP2C9 in human liver microsomes after 10 mins by LC/MS/MS analysis
Bioorg Med Chem 21: 2868-78 (2013)
Article DOI: 10.1016/j.bmc.2013.03.069
BindingDB Entry DOI: 10.7270/Q2JM2C1J
Cytochrome P450 2C19
(Homo sapiens (Human))
BDBM50434690
(CHEMBL2387594)
Show SMILES CCc1ccc2c3nc([nH]c3c(=O)[nH]c2c1)-c1ccccc1Cl
Show InChI InChI=1S/C18H14ClN3O/c1-2-10-7-8-12-14(9-10)20-18(23)16-15(12)21-17(22-16)11-5-3-4-6-13(11)19/h3-9H,2H2,1H3,(H,20,23)(H,21,22)
Reactome pathway
n/an/a>3.00E+4n/an/an/an/an/an/a
Dainippon Sumitomo Pharma. Co. Ltd
Curated by ChEMBL
Assay Description
Inhibition of CYP2C19 in human liver microsomes after 10 mins by LC/MS/MS analysis
Bioorg Med Chem 21: 2868-78 (2013)
Article DOI: 10.1016/j.bmc.2013.03.069
BindingDB Entry DOI: 10.7270/Q2JM2C1J