BDBM50434756 CHEMBL2385581
SMILES: Clc1cc(ccn1)-c1cnn2cc(cnc12)-c1ccc(cc1)N1CCOCC1
InChI Key: InChIKey=OBHNWKOQLJZZQW-UHFFFAOYSA-N
Data: 1 IC50
Activity Spreadsheet -- Enzyme Inhibition Constant Data from BindingDB
Found 1 hit for monomerid = 50434756
Trg + Lig
Ki
nM
ΔG°
kcal/mole
IC50
nM
Kd
nM
EC50/IC50
nM
koff
s-1
kon
M-1s-1
pHTemp
°C
Bone morphogenetic protein 4
(Mus musculus)
BDBM50434756
(CHEMBL2385581)
Show SMILES Clc1cc(ccn1)-c1cnn2cc(cnc12)-c1ccc(cc1)N1CCOCC1
Show InChI InChI=1S/C21H18ClN5O/c22-20-11-16(5-6-23-20)19-13-25-27-14-17(12-24-21(19)27)15-1-3-18(4-2-15)26-7-9-28-10-8-26/h1-6,11-14H,7-10H2
Reactome pathway
n/an/a 529n/an/an/an/an/an/a
Vanderbilt University Medical Center
Curated by ChEMBL
Assay Description
Inhibition of BMP4 in mouse C2C12BRA cells after 14 hrs by luciferase reporter gene assay
Bioorg Med Chem Lett 23: 3248-52 (2013)
Article DOI: 10.1016/j.bmcl.2013.03.113
BindingDB Entry DOI: 10.7270/Q2WW7K3P