BDBM50434846 CHEMBL2387399::US9040518, 35
SMILES: CCCC[C@]1(CC)CS(=O)(=O)c2cc(CNCCS(O)(=O)=O)c(OC)cc2[C@H](N1)c1ccccc1
InChI Key: InChIKey=CYDNTKYPQAZFFS-JWQCQUIFSA-N
Data: 4 IC50
Activity Spreadsheet -- Enzyme Inhibition Constant Data from BindingDB
Found 4 hits for monomerid = 50434846
Trg + Lig
Ki
nM
ΔG°
kcal/mole
IC50
nM
Kd
nM
EC50/IC50
nM
koff
s-1
kon
M-1s-1
pHTemp
°C
Ileal bile acid transporter/bile acid cotransporter
(Homo sapiens (Human))
BDBM50434846
(CHEMBL2387399 | US9040518, 35)
Show SMILES CCCC[C@]1(CC)CS(=O)(=O)c2cc(CNCCS(O)(=O)=O)c(OC)cc2[C@H](N1)c1ccccc1 |r|
Show InChI InChI=1S/C25H36N2O6S2/c1-4-6-12-25(5-2)18-34(28,29)23-15-20(17-26-13-14-35(30,31)32)22(33-3)16-21(23)24(27-25)19-10-8-7-9-11-19/h7-11,15-16,24,26-27H,4-6,12-14,17-18H2,1-3H3,(H,30,31,32)/t24-,25-/m1/s1
US Patent
n/an/a 54n/an/an/an/an/a25
GlaxoSmithKline LLC
US Patent
Assay Description
On the day of the uptake experiment, 10 mM HEPES was added to Hank's Balanced Salt Solution, and the pH was adjusted to 7.4 with TRIS (HBSSH). The as...
US Patent US9040518 (2015)
BindingDB Entry DOI: 10.7270/Q2T72G58
Ileal bile acid transporter/bile acid cotransporter
(Homo sapiens (Human))
BDBM50434846
(CHEMBL2387399 | US9040518, 35)
Show SMILES CCCC[C@]1(CC)CS(=O)(=O)c2cc(CNCCS(O)(=O)=O)c(OC)cc2[C@H](N1)c1ccccc1 |r|
Show InChI InChI=1S/C25H36N2O6S2/c1-4-6-12-25(5-2)18-34(28,29)23-15-20(17-26-13-14-35(30,31)32)22(33-3)16-21(23)24(27-25)19-10-8-7-9-11-19/h7-11,15-16,24,26-27H,4-6,12-14,17-18H2,1-3H3,(H,30,31,32)/t24-,25-/m1/s1
n/an/a 54n/an/an/an/an/an/a
GlaxoSmithKline Research& Development
Curated by ChEMBL
Assay Description
Inhibition of human ASBT expressed in HEK293 cells assessed as inhibition of [3H]-taurocholate uptake after 90 mins by scintillation counting analysi...
J Med Chem 56: 5094-114 (2013)
Article DOI: 10.1021/jm400459m
BindingDB Entry DOI: 10.7270/Q2MC91D6
Ileal sodium/bile acid cotransporter
(Mus musculus)
BDBM50434846
(CHEMBL2387399 | US9040518, 35)
Show SMILES CCCC[C@]1(CC)CS(=O)(=O)c2cc(CNCCS(O)(=O)=O)c(OC)cc2[C@H](N1)c1ccccc1 |r|
Show InChI InChI=1S/C25H36N2O6S2/c1-4-6-12-25(5-2)18-34(28,29)23-15-20(17-26-13-14-35(30,31)32)22(33-3)16-21(23)24(27-25)19-10-8-7-9-11-19/h7-11,15-16,24,26-27H,4-6,12-14,17-18H2,1-3H3,(H,30,31,32)/t24-,25-/m1/s1
Reactome pathway
n/an/a 0.900n/an/an/an/an/an/a
GlaxoSmithKline Research& Development
Curated by ChEMBL
Assay Description
Inhibition of mouse ASBT expressed in HEK293 cells assessed as inhibition of [3H]-taurocholate uptake after 90 mins by scintillation counting analysi...
J Med Chem 56: 5094-114 (2013)
Article DOI: 10.1021/jm400459m
BindingDB Entry DOI: 10.7270/Q2MC91D6
Ileal sodium/bile acid cotransporter
(Rattus norvegicus)
BDBM50434846
(CHEMBL2387399 | US9040518, 35)
Show SMILES CCCC[C@]1(CC)CS(=O)(=O)c2cc(CNCCS(O)(=O)=O)c(OC)cc2[C@H](N1)c1ccccc1 |r|
Show InChI InChI=1S/C25H36N2O6S2/c1-4-6-12-25(5-2)18-34(28,29)23-15-20(17-26-13-14-35(30,31)32)22(33-3)16-21(23)24(27-25)19-10-8-7-9-11-19/h7-11,15-16,24,26-27H,4-6,12-14,17-18H2,1-3H3,(H,30,31,32)/t24-,25-/m1/s1
Reactome pathway
n/an/a 2.30n/an/an/an/an/an/a
GlaxoSmithKline Research& Development
Curated by ChEMBL
Assay Description
Inhibition of rat ASBT expressed in HEK293 cells assessed as inhibition of [3H]-taurocholate uptake after 90 mins by scintillation counting analysis
J Med Chem 56: 5094-114 (2013)
Article DOI: 10.1021/jm400459m
BindingDB Entry DOI: 10.7270/Q2MC91D6