BDBM50434911 CHEMBL2385248
SMILES: CC(C(=O)NCc1ccc(nc1OCC1CCC1)C(F)(F)F)c1ccc(NS(C)(=O)=O)c(F)c1
InChI Key: InChIKey=QBCITRXUVWOHQC-UHFFFAOYSA-N
Data: 1 KI  1 IC50
Activity Spreadsheet -- Enzyme Inhibition Constant Data from BindingDB
Found 2 hits for monomerid = 50434911
Trg + Lig
Ki
nM
ΔG°
kcal/mole
IC50
nM
Kd
nM
EC50/IC50
nM
koff
s-1
kon
M-1s-1
pHTemp
°C
Transient receptor potential cation channel subfamily V member 1
(Homo sapiens (Human))
BDBM50434911
(CHEMBL2385248)
Show SMILES CC(C(=O)NCc1ccc(nc1OCC1CCC1)C(F)(F)F)c1ccc(NS(C)(=O)=O)c(F)c1
Show InChI InChI=1S/C22H25F4N3O4S/c1-13(15-6-8-18(17(23)10-15)29-34(2,31)32)20(30)27-11-16-7-9-19(22(24,25)26)28-21(16)33-12-14-4-3-5-14/h6-10,13-14,29H,3-5,11-12H2,1-2H3,(H,27,30)
Reactome pathway
0.300n/an/an/an/an/an/an/an/a
Seoul National University
Curated by ChEMBL
Assay Description
Antagonist activity at human TRPV1 expressed in CHOK1 cells assessed as inhibition of capsaicin-induced activity by FLIPR assay
Eur J Med Chem 64: 589-602 (2013)
Article DOI: 10.1016/j.ejmech.2013.04.003
BindingDB Entry DOI: 10.7270/Q2BZ67FC
Transient receptor potential cation channel subfamily V member 1
(Homo sapiens (Human))
BDBM50434911
(CHEMBL2385248)
Show SMILES CC(C(=O)NCc1ccc(nc1OCC1CCC1)C(F)(F)F)c1ccc(NS(C)(=O)=O)c(F)c1
Show InChI InChI=1S/C22H25F4N3O4S/c1-13(15-6-8-18(17(23)10-15)29-34(2,31)32)20(30)27-11-16-7-9-19(22(24,25)26)28-21(16)33-12-14-4-3-5-14/h6-10,13-14,29H,3-5,11-12H2,1-2H3,(H,27,30)
Reactome pathway
n/an/a 41n/an/an/an/a6.0n/a
Seoul National University
Curated by ChEMBL
Assay Description
Antagonist activity at human TRPV1 expressed in CHOK1 cells assessed as inhibition of pH 6 to 6.3-induced activity by FLIPR assay
Eur J Med Chem 64: 589-602 (2013)
Article DOI: 10.1016/j.ejmech.2013.04.003
BindingDB Entry DOI: 10.7270/Q2BZ67FC