BDBM50434913 CHEMBL2385246
SMILES: CC(C(=O)NCc1ccc(nc1OC[C@@H]1C[C@H]1C)C(F)(F)F)c1ccc(NS(C)(=O)=O)c(F)c1
InChI Key: InChIKey=YPUYKRCDAKESFQ-LRRQEPCHSA-N
Data: 1 KI  1 IC50
Activity Spreadsheet -- Enzyme Inhibition Constant Data from BindingDB
Found 2 hits for monomerid = 50434913
Trg + Lig
Ki
nM
ΔG°
kcal/mole
IC50
nM
Kd
nM
EC50/IC50
nM
koff
s-1
kon
M-1s-1
pHTemp
°C
Transient receptor potential cation channel subfamily V member 1
(Homo sapiens (Human))
BDBM50434913
(CHEMBL2385246)
Show SMILES CC(C(=O)NCc1ccc(nc1OC[C@@H]1C[C@H]1C)C(F)(F)F)c1ccc(NS(C)(=O)=O)c(F)c1 |r|
Show InChI InChI=1S/C22H25F4N3O4S/c1-12-8-16(12)11-33-21-15(5-7-19(28-21)22(24,25)26)10-27-20(30)13(2)14-4-6-18(17(23)9-14)29-34(3,31)32/h4-7,9,12-13,16,29H,8,10-11H2,1-3H3,(H,27,30)/t12-,13?,16+/m1/s1
Reactome pathway
0.300n/an/an/an/an/an/an/an/a
Seoul National University
Curated by ChEMBL
Assay Description
Antagonist activity at human TRPV1 expressed in CHOK1 cells assessed as inhibition of capsaicin-induced activity by FLIPR assay
Eur J Med Chem 64: 589-602 (2013)
Article DOI: 10.1016/j.ejmech.2013.04.003
BindingDB Entry DOI: 10.7270/Q2BZ67FC
Transient receptor potential cation channel subfamily V member 1
(Homo sapiens (Human))
BDBM50434913
(CHEMBL2385246)
Show SMILES CC(C(=O)NCc1ccc(nc1OC[C@@H]1C[C@H]1C)C(F)(F)F)c1ccc(NS(C)(=O)=O)c(F)c1 |r|
Show InChI InChI=1S/C22H25F4N3O4S/c1-12-8-16(12)11-33-21-15(5-7-19(28-21)22(24,25)26)10-27-20(30)13(2)14-4-6-18(17(23)9-14)29-34(3,31)32/h4-7,9,12-13,16,29H,8,10-11H2,1-3H3,(H,27,30)/t12-,13?,16+/m1/s1
Reactome pathway
n/an/a 5.10n/an/an/an/a6.0n/a
Seoul National University
Curated by ChEMBL
Assay Description
Antagonist activity at human TRPV1 expressed in CHOK1 cells assessed as inhibition of pH 6 to 6.3-induced activity by FLIPR assay
Eur J Med Chem 64: 589-602 (2013)
Article DOI: 10.1016/j.ejmech.2013.04.003
BindingDB Entry DOI: 10.7270/Q2BZ67FC