BDBM50435020 CHEMBL2391126
SMILES: COc1ccc(cc1)-c1ccc(CSc2nnc(o2)-c2ccc3OCCOc3c2)cc1
InChI Key: InChIKey=ZYDQWWRARYHYHC-UHFFFAOYSA-N
Data: 3 IC50
Activity Spreadsheet -- Enzyme Inhibition Constant Data from BindingDB
Found 3 hits for monomerid = 50435020
Trg + Lig
Ki
nM
ΔG°
kcal/mole
IC50
nM
Kd
nM
EC50/IC50
nM
koff
s-1
kon
M-1s-1
pHTemp
°C
Aurora kinase A
(Homo sapiens (Human))
BDBM50435020
(CHEMBL2391126)
Show SMILES COc1ccc(cc1)-c1ccc(CSc2nnc(o2)-c2ccc3OCCOc3c2)cc1
Show InChI InChI=1S/C24H20N2O4S/c1-27-20-9-6-18(7-10-20)17-4-2-16(3-5-17)15-31-24-26-25-23(30-24)19-8-11-21-22(14-19)29-13-12-28-21/h2-11,14H,12-13,15H2,1H3
NCI pathway
Reactome pathway
n/an/a>1.00E+5n/an/an/an/an/an/a
Technische Universit£t Darmstadt
Curated by ChEMBL
Assay Description
Inhibition of human recombinant AURKA by FRET assay
Eur J Med Chem 61: 26-40 (2013)
Article DOI: 10.1016/j.ejmech.2012.06.006
BindingDB Entry DOI: 10.7270/Q2KD209T
Cyclin-dependent-like kinase 5
(Homo sapiens (Human))
BDBM50435020
(CHEMBL2391126)
Show SMILES COc1ccc(cc1)-c1ccc(CSc2nnc(o2)-c2ccc3OCCOc3c2)cc1
Show InChI InChI=1S/C24H20N2O4S/c1-27-20-9-6-18(7-10-20)17-4-2-16(3-5-17)15-31-24-26-25-23(30-24)19-8-11-21-22(14-19)29-13-12-28-21/h2-11,14H,12-13,15H2,1H3
NCI pathway
Reactome pathway
n/an/a>1.00E+5n/an/an/an/an/an/a
Technische Universit£t Darmstadt
Curated by ChEMBL
Assay Description
Inhibition of human recombinant Cdk5/p35 by FRET assay
Eur J Med Chem 61: 26-40 (2013)
Article DOI: 10.1016/j.ejmech.2012.06.006
BindingDB Entry DOI: 10.7270/Q2KD209T
Casein kinase I isoform epsilon
(Homo sapiens (Human))
BDBM50435020
(CHEMBL2391126)
Show SMILES COc1ccc(cc1)-c1ccc(CSc2nnc(o2)-c2ccc3OCCOc3c2)cc1
Show InChI InChI=1S/C24H20N2O4S/c1-27-20-9-6-18(7-10-20)17-4-2-16(3-5-17)15-31-24-26-25-23(30-24)19-8-11-21-22(14-19)29-13-12-28-21/h2-11,14H,12-13,15H2,1H3
n/an/a>1.00E+5n/an/an/an/an/an/a
Technische Universit£t Darmstadt
Curated by ChEMBL
Assay Description
Inhibition of human recombinant CK1epsilon by FRET assay
Eur J Med Chem 61: 26-40 (2013)
Article DOI: 10.1016/j.ejmech.2012.06.006
BindingDB Entry DOI: 10.7270/Q2KD209T