BDBM50435036 CHEMBL2391123
SMILES: C(Sc1nnc(o1)-c1ccc2OCCOc2c1)c1ccc(cc1)-c1ccccc1
InChI Key: InChIKey=PMMSNAUVALVAPD-UHFFFAOYSA-N
Data: 3 IC50
Activity Spreadsheet -- Enzyme Inhibition Constant Data from BindingDB
Found 3 hits for monomerid = 50435036
Trg + Lig
Ki
nM
ΔG°
kcal/mole
IC50
nM
Kd
nM
EC50/IC50
nM
koff
s-1
kon
M-1s-1
pHTemp
°C
Casein kinase I isoform epsilon
(Homo sapiens (Human))
BDBM50435036
(CHEMBL2391123)
Show SMILES C(Sc1nnc(o1)-c1ccc2OCCOc2c1)c1ccc(cc1)-c1ccccc1
Show InChI InChI=1S/C23H18N2O3S/c1-2-4-17(5-3-1)18-8-6-16(7-9-18)15-29-23-25-24-22(28-23)19-10-11-20-21(14-19)27-13-12-26-20/h1-11,14H,12-13,15H2
n/an/a>1.00E+5n/an/an/an/an/an/a
Technische Universit£t Darmstadt
Curated by ChEMBL
Assay Description
Inhibition of human recombinant CK1epsilon by FRET assay
Eur J Med Chem 61: 26-40 (2013)
Article DOI: 10.1016/j.ejmech.2012.06.006
BindingDB Entry DOI: 10.7270/Q2KD209T
Aurora kinase A
(Homo sapiens (Human))
BDBM50435036
(CHEMBL2391123)
Show SMILES C(Sc1nnc(o1)-c1ccc2OCCOc2c1)c1ccc(cc1)-c1ccccc1
Show InChI InChI=1S/C23H18N2O3S/c1-2-4-17(5-3-1)18-8-6-16(7-9-18)15-29-23-25-24-22(28-23)19-10-11-20-21(14-19)27-13-12-26-20/h1-11,14H,12-13,15H2
NCI pathway
Reactome pathway
n/an/a>1.00E+5n/an/an/an/an/an/a
Technische Universit£t Darmstadt
Curated by ChEMBL
Assay Description
Inhibition of human recombinant AURKA by FRET assay
Eur J Med Chem 61: 26-40 (2013)
Article DOI: 10.1016/j.ejmech.2012.06.006
BindingDB Entry DOI: 10.7270/Q2KD209T
Cyclin-dependent-like kinase 5
(Homo sapiens (Human))
BDBM50435036
(CHEMBL2391123)
Show SMILES C(Sc1nnc(o1)-c1ccc2OCCOc2c1)c1ccc(cc1)-c1ccccc1
Show InChI InChI=1S/C23H18N2O3S/c1-2-4-17(5-3-1)18-8-6-16(7-9-18)15-29-23-25-24-22(28-23)19-10-11-20-21(14-19)27-13-12-26-20/h1-11,14H,12-13,15H2
NCI pathway
Reactome pathway
n/an/a>1.00E+5n/an/an/an/an/an/a
Technische Universit£t Darmstadt
Curated by ChEMBL
Assay Description
Inhibition of human recombinant Cdk5/p35 by FRET assay
Eur J Med Chem 61: 26-40 (2013)
Article DOI: 10.1016/j.ejmech.2012.06.006
BindingDB Entry DOI: 10.7270/Q2KD209T