BDBM50435162 CHEMBL2392758
SMILES: Cc1onc(NC(=O)NC23CC4CC(CC(C4)C2)C3)c1Br
InChI Key: InChIKey=QTPMYQMWPIFNGE-UHFFFAOYSA-N
Data: 1 IC50
Activity Spreadsheet -- Enzyme Inhibition Constant Data from BindingDB
Found 1 hit for monomerid = 50435162
Trg + Lig
Ki
nM
ΔG°
kcal/mole
IC50
nM
Kd
nM
EC50/IC50
nM
koff
s-1
kon
M-1s-1
pHTemp
°C
EBifunctional epoxide hydrolase 2
(Homo sapiens (Human))
BDBM50435162
(CHEMBL2392758)
Show SMILES Cc1onc(NC(=O)NC23CC4CC(CC(C4)C2)C3)c1Br |TLB:8:9:12:16.15.14,THB:10:11:14:18.9.17,10:9:12.11.16:14,17:9:12:16.15.14,17:15:12:18.10.9|
Show InChI InChI=1S/C15H20BrN3O2/c1-8-12(16)13(19-21-8)17-14(20)18-15-5-9-2-10(6-15)4-11(3-9)7-15/h9-11H,2-7H2,1H3,(H2,17,18,19,20)
n/an/a 0.800n/an/an/an/an/an/a
St. Jude Children's Research Hospital
Curated by ChEMBL
Assay Description
Inhibition of recombinant human soluble epoxide hydrolase using CMNPC as substrate preincubated for 5 mins before substrate addition measured after 1...
Bioorg Med Chem 21: 2587-99 (2013)
Article DOI: 10.1016/j.bmc.2013.02.028
BindingDB Entry DOI: 10.7270/Q2DR2WXJ