BDBM50435221 CHEMBL2392896
SMILES: Cc1nc(nc(NC[C@H](NCCCN2CCN(CCO)CC2)c2ccccc2)c1Cl)-c1ccccn1
InChI Key: InChIKey=LBYCNMYKZOCLLW-DEOSSOPVSA-N
Data: 2 IC50
Activity Spreadsheet -- Enzyme Inhibition Constant Data from BindingDB
Found 2 hits for monomerid = 50435221
Trg + Lig
Ki
nM
ΔG°
kcal/mole
IC50
nM
Kd
nM
EC50/IC50
nM
koff
s-1
kon
M-1s-1
pHTemp
°C
Methionine Aminopeptidase Type 1 (MetAP1)
(Homo sapiens (Human))
BDBM50435221
(CHEMBL2392896)
Show SMILES Cc1nc(nc(NC[C@H](NCCCN2CCN(CCO)CC2)c2ccccc2)c1Cl)-c1ccccn1 |r|
Show InChI InChI=1S/C27H36ClN7O/c1-21-25(28)27(33-26(32-21)23-10-5-6-11-29-23)31-20-24(22-8-3-2-4-9-22)30-12-7-13-34-14-16-35(17-15-34)18-19-36/h2-6,8-11,24,30,36H,7,12-20H2,1H3,(H,31,32,33)/t24-/m0/s1
Reactome pathway
n/an/a 1.70E+3n/an/an/an/an/an/a
Chinese Academy of Sciences
Curated by ChEMBL
Assay Description
Inhibition of human recombinant full-length cytosolic METAP1 expressed in Escherichia coli BL21(DE3) using Met-Pro-p-nitroanilide as substrate after ...
Bioorg Med Chem 21: 2600-17 (2013)
Article DOI: 10.1016/j.bmc.2013.02.023
BindingDB Entry DOI: 10.7270/Q290256X
Microtubule-associated protein 2
(Homo sapiens (Human))
BDBM50435221
(CHEMBL2392896)
Show SMILES Cc1nc(nc(NC[C@H](NCCCN2CCN(CCO)CC2)c2ccccc2)c1Cl)-c1ccccn1 |r|
Show InChI InChI=1S/C27H36ClN7O/c1-21-25(28)27(33-26(32-21)23-10-5-6-11-29-23)31-20-24(22-8-3-2-4-9-22)30-12-7-13-34-14-16-35(17-15-34)18-19-36/h2-6,8-11,24,30,36H,7,12-20H2,1H3,(H,31,32,33)/t24-/m0/s1
n/an/a 1.01E+5n/an/an/an/an/an/a
Chinese Academy of Sciences
Curated by ChEMBL
Assay Description
Inhibition of human recombinant GST-6XHis-tagged full-length cytosolic METAP2 expressed in cabbage looper BTI-TN-5B1-4 cells using Met-Pro-p-nitroani...
Bioorg Med Chem 21: 2600-17 (2013)
Article DOI: 10.1016/j.bmc.2013.02.023
BindingDB Entry DOI: 10.7270/Q290256X