BDBM50435268 CHEMBL2393229
SMILES: Cc1cccc(Nc2ccccc2C(=O)NCCCCCCCCCCNc2c3CCCCc3nc3cc(Cl)ccc23)c1C
InChI Key: InChIKey=XIFDKURJIBPHLZ-UHFFFAOYSA-N
Data: 2 IC50
Activity Spreadsheet -- Enzyme Inhibition Constant Data from BindingDB
Found 2 hits for monomerid = 50435268
Trg + Lig
Ki
nM
ΔG°
kcal/mole
IC50
nM
Kd
nM
EC50/IC50
nM
koff
s-1
kon
M-1s-1
pHTemp
°C
Acetylcholinesterase
(Electrophorus electricus (Electric eel))
BDBM50435268
(CHEMBL2393229)
Show SMILES Cc1cccc(Nc2ccccc2C(=O)NCCCCCCCCCCNc2c3CCCCc3nc3cc(Cl)ccc23)c1C
Show InChI InChI=1S/C38H47ClN4O/c1-27-16-15-21-33(28(27)2)42-35-20-12-10-18-32(35)38(44)41-25-14-8-6-4-3-5-7-13-24-40-37-30-17-9-11-19-34(30)43-36-26-29(39)22-23-31(36)37/h10,12,15-16,18,20-23,26,42H,3-9,11,13-14,17,19,24-25H2,1-2H3,(H,40,43)(H,41,44)
n/an/a 0.776n/an/an/an/an/an/a
University of Michigan
Curated by ChEMBL
Assay Description
Inhibition of electric eel AChE using acetylthiocholine as substrate preincubated for 10 mins prior to substrate addition measured every 30 seconds f...
Bioorg Med Chem 21: 3614-23 (2013)
Article DOI: 10.1016/j.bmc.2013.02.047
BindingDB Entry DOI: 10.7270/Q2WQ0557
Acetylcholinesterase
(Electrophorus electricus (Electric eel))
BDBM50435268
(CHEMBL2393229)
Show SMILES Cc1cccc(Nc2ccccc2C(=O)NCCCCCCCCCCNc2c3CCCCc3nc3cc(Cl)ccc23)c1C
Show InChI InChI=1S/C38H47ClN4O/c1-27-16-15-21-33(28(27)2)42-35-20-12-10-18-32(35)38(44)41-25-14-8-6-4-3-5-7-13-24-40-37-30-17-9-11-19-34(30)43-36-26-29(39)22-23-31(36)37/h10,12,15-16,18,20-23,26,42H,3-9,11,13-14,17,19,24-25H2,1-2H3,(H,40,43)(H,41,44)
n/an/a 1.90n/an/an/an/an/an/a
University of Michigan
Curated by ChEMBL
Assay Description
Inhibition of electric eel AChE preincubated for 30 mins prior to horseradish peroxidase, H2O2 and DETAPAC addition measured for 20 mins under ROS co...
Bioorg Med Chem 21: 3614-23 (2013)
Article DOI: 10.1016/j.bmc.2013.02.047
BindingDB Entry DOI: 10.7270/Q2WQ0557