BDBM50435288 CHEMBL2393098
SMILES: CCCCCNc1c2CCCCc2nc2cc(Cl)ccc12
InChI Key: InChIKey=MTOKTZRTWPMQMY-UHFFFAOYSA-N
Data: 2 IC50
Activity Spreadsheet -- Enzyme Inhibition Constant Data from BindingDB
Found 2 hits for monomerid = 50435288
Trg + Lig
Ki
nM
ΔG°
kcal/mole
IC50
nM
Kd
nM
EC50/IC50
nM
koff
s-1
kon
M-1s-1
pHTemp
°C
Acetylcholinesterase
(Electrophorus electricus (Electric eel))
BDBM50435288
(CHEMBL2393098)
Show SMILES CCCCCNc1c2CCCCc2nc2cc(Cl)ccc12
Show InChI InChI=1S/C18H23ClN2/c1-2-3-6-11-20-18-14-7-4-5-8-16(14)21-17-12-13(19)9-10-15(17)18/h9-10,12H,2-8,11H2,1H3,(H,20,21)
n/an/a 26n/an/an/an/an/an/a
University of Michigan
Curated by ChEMBL
Assay Description
Inhibition of electric eel AChE using acetylthiocholine as substrate preincubated for 10 mins prior to substrate addition measured every 30 seconds f...
Bioorg Med Chem 21: 3614-23 (2013)
Article DOI: 10.1016/j.bmc.2013.02.047
BindingDB Entry DOI: 10.7270/Q2WQ0557
Acetylcholinesterase
(Electrophorus electricus (Electric eel))
BDBM50435288
(CHEMBL2393098)
Show SMILES CCCCCNc1c2CCCCc2nc2cc(Cl)ccc12
Show InChI InChI=1S/C18H23ClN2/c1-2-3-6-11-20-18-14-7-4-5-8-16(14)21-17-12-13(19)9-10-15(17)18/h9-10,12H,2-8,11H2,1H3,(H,20,21)
n/an/a 43n/an/an/an/an/an/a
University of Michigan
Curated by ChEMBL
Assay Description
Inhibition of electric eel AChE preincubated for 30 mins prior to horseradish peroxidase, H2O2 and DETAPAC addition measured for 20 mins under ROS co...
Bioorg Med Chem 21: 3614-23 (2013)
Article DOI: 10.1016/j.bmc.2013.02.047
BindingDB Entry DOI: 10.7270/Q2WQ0557