BDBM50435579 CHEMBL2393145
SMILES: CN(C)CCOc1cccc2n(c(nc12)C(F)F)-c1nc(nc(n1)N1CCOCC1)N1CCOCC1
InChI Key: InChIKey=YQKQVUXNVLTSTL-UHFFFAOYSA-N
Data: 3 IC50
Activity Spreadsheet -- Enzyme Inhibition Constant Data from BindingDB
Found 3 hits for monomerid = 50435579
Trg + Lig
Ki
nM
ΔG°
kcal/mole
IC50
nM
Kd
nM
EC50/IC50
nM
koff
s-1
kon
M-1s-1
pHTemp
°C
Phosphoinositide 3-Kinase (PI3K), delta
(Homo sapiens (Human))
BDBM50435579
(CHEMBL2393145)
Show SMILES CN(C)CCOc1cccc2n(c(nc12)C(F)F)-c1nc(nc(n1)N1CCOCC1)N1CCOCC1
Show InChI InChI=1S/C23H30F2N8O3/c1-30(2)6-15-36-17-5-3-4-16-18(17)26-20(19(24)25)33(16)23-28-21(31-7-11-34-12-8-31)27-22(29-23)32-9-13-35-14-10-32/h3-5,19H,6-15H2,1-2H3
NCI pathway
Reactome pathway
n/an/a 19n/an/an/an/an/an/a
University of Auckland
Curated by ChEMBL
Assay Description
Inhibition of recombinant PI3K p110delta/p85alpha (unknown origin) using phosphotidylinositol as susbstrate after 1 hr by thin layer paper chromatogr...
Eur J Med Chem 64: 137-47 (2013)
Article DOI: 10.1016/j.ejmech.2013.03.038
BindingDB Entry DOI: 10.7270/Q2377B33
p110α/p85α
(Homo sapiens (Human))
BDBM50435579
(CHEMBL2393145)
Show SMILES CN(C)CCOc1cccc2n(c(nc12)C(F)F)-c1nc(nc(n1)N1CCOCC1)N1CCOCC1
Show InChI InChI=1S/C23H30F2N8O3/c1-30(2)6-15-36-17-5-3-4-16-18(17)26-20(19(24)25)33(16)23-28-21(31-7-11-34-12-8-31)27-22(29-23)32-9-13-35-14-10-32/h3-5,19H,6-15H2,1-2H3
n/an/a 35n/an/an/an/an/an/a
University of Auckland
Curated by ChEMBL
Assay Description
Inhibition of recombinant PI3K p110alpha/p85alpha (unknown origin) using phosphotidylinositol as susbstrate after 1 hr by thin layer paper chromatogr...
Eur J Med Chem 64: 137-47 (2013)
Article DOI: 10.1016/j.ejmech.2013.03.038
BindingDB Entry DOI: 10.7270/Q2377B33
p110β/p85α
(Homo sapiens (Human))
BDBM50435579
(CHEMBL2393145)
Show SMILES CN(C)CCOc1cccc2n(c(nc12)C(F)F)-c1nc(nc(n1)N1CCOCC1)N1CCOCC1
Show InChI InChI=1S/C23H30F2N8O3/c1-30(2)6-15-36-17-5-3-4-16-18(17)26-20(19(24)25)33(16)23-28-21(31-7-11-34-12-8-31)27-22(29-23)32-9-13-35-14-10-32/h3-5,19H,6-15H2,1-2H3
n/an/a 105n/an/an/an/an/an/a
University of Auckland
Curated by ChEMBL
Assay Description
Inhibition of recombinant PI3K p110beta/p85alpha (unknown origin) using phosphotidylinositol as susbstrate after 1 hr by thin layer paper chromatogra...
Eur J Med Chem 64: 137-47 (2013)
Article DOI: 10.1016/j.ejmech.2013.03.038
BindingDB Entry DOI: 10.7270/Q2377B33