BDBM50435752 CHEMBL2392699
SMILES: CNc1nc(C)cc(n1)N1CCC(CC1)C(=O)NCc1ccccc1C(F)(F)F
InChI Key: InChIKey=PEQMLSNZUIKHCQ-UHFFFAOYSA-N
Data: 2 IC50
Activity Spreadsheet -- Enzyme Inhibition Constant Data from BindingDB
Found 2 hits for monomerid = 50435752
Trg + Lig
Ki
nM
ΔG°
kcal/mole
IC50
nM
Kd
nM
EC50/IC50
nM
koff
s-1
kon
M-1s-1
pHTemp
°C
Cytochrome P450 2C9
(Homo sapiens (Human))
BDBM50435752
(CHEMBL2392699)
Show SMILES CNc1nc(C)cc(n1)N1CCC(CC1)C(=O)NCc1ccccc1C(F)(F)F
Show InChI InChI=1S/C20H24F3N5O/c1-13-11-17(27-19(24-2)26-13)28-9-7-14(8-10-28)18(29)25-12-15-5-3-4-6-16(15)20(21,22)23/h3-6,11,14H,7-10,12H2,1-2H3,(H,25,29)(H,24,26,27)
Reactome pathway
n/an/a>2.50E+4n/an/an/an/an/an/a
GlaxoSmithKline
Curated by ChEMBL
Assay Description
Inhibition of CYP2C9 (unknown origin)
Bioorg Med Chem Lett 23: 3584-8 (2013)
Article DOI: 10.1016/j.bmcl.2013.04.019
BindingDB Entry DOI: 10.7270/Q2J967S5
EBifunctional epoxide hydrolase 2
(Homo sapiens (Human))
BDBM50435752
(CHEMBL2392699)
Show SMILES CNc1nc(C)cc(n1)N1CCC(CC1)C(=O)NCc1ccccc1C(F)(F)F
Show InChI InChI=1S/C20H24F3N5O/c1-13-11-17(27-19(24-2)26-13)28-9-7-14(8-10-28)18(29)25-12-15-5-3-4-6-16(15)20(21,22)23/h3-6,11,14H,7-10,12H2,1-2H3,(H,25,29)(H,24,26,27)
n/an/a 40n/an/an/an/an/an/a
GlaxoSmithKline
Curated by ChEMBL
Assay Description
Inhibition of human soluble epoxide hydrolase using PHOME as substrate assessed as formation of 6-methoxy-2-naphthaldehyde incubated for 10 mins prio...
Bioorg Med Chem Lett 23: 3584-8 (2013)
Article DOI: 10.1016/j.bmcl.2013.04.019
BindingDB Entry DOI: 10.7270/Q2J967S5