null
SMILES: Clc1ccccc1CSc1nnc(Cn2nnc3ccccc23)o1
InChI Key: InChIKey=OJGWNOSQXMYVJR-UHFFFAOYSA-N
Activity Spreadsheet -- Enzyme Inhibition Constant Data from BindingDB
Found 1 hit for monomerid = 50435847
Trg + Lig
Ki
nM
ΔG°
kcal/mole
IC50
nM
Kd
nM
EC50/IC50
nM
koff
s-1
kon
M-1s-1
pHTemp
°C
Focal adhesion kinase 1
(Homo sapiens (Human))
BDBM50435847
(CHEMBL2393379)
Show SMILES Clc1ccccc1CSc1nnc(Cn2nnc3ccccc23)o1
Show InChI InChI=1S/C16H12ClN5OS/c17-12-6-2-1-5-11(12)10-24-16-20-19-15(23-16)9-22-14-8-4-3-7-13(14)18-21-22/h1-8H,9-10H2
NCI pathway
Reactome pathway
n/an/a 9.50E+3n/an/an/an/an/an/a
Nanjing University
Curated by ChEMBL
Assay Description
Inhibition of FAK assembly (unknown origin) after 20 mins by TRAP-PCR-ELISA
Bioorg Med Chem 21: 3723-9 (2013)
Article DOI: 10.1016/j.bmc.2013.04.043
BindingDB Entry DOI: 10.7270/Q2542PZ4