null
SMILES: Cc1cc(N)c(=O)n(CC(=O)Nc2ccc(Br)cc2)n1
InChI Key: InChIKey=WPYRTEPZXMIHCR-UHFFFAOYSA-N
Activity Spreadsheet -- Enzyme Inhibition Constant Data from BindingDB
Found 1 hit for monomerid = 50435895
Trg + Lig
Ki
nM
ΔG°
kcal/mole
IC50
nM
Kd
nM
EC50/IC50
nM
koff
s-1
kon
M-1s-1
pHTemp
°C
N-formyl peptide receptor 3
(Homo sapiens (Human))
BDBM50435895
(CHEMBL2391448)
Show SMILES Cc1cc(N)c(=O)n(CC(=O)Nc2ccc(Br)cc2)n1
Show InChI InChI=1S/C13H13BrN4O2/c1-8-6-11(15)13(20)18(17-8)7-12(19)16-10-4-2-9(14)3-5-10/h2-6H,7,15H2,1H3,(H,16,19)
NCI pathway
Reactome pathway
n/an/an/an/a>5.00E+4n/an/an/an/a
Universit£ degli Studi di Firenze
Curated by ChEMBL
Assay Description
Agonist activity at FPR3 (unknown origin) transfected in human HL60 cells assessed as induction of Ca2+ mobilization
Eur J Med Chem 64: 512-28 (2013)
Article DOI: 10.1016/j.ejmech.2013.03.066
BindingDB Entry DOI: 10.7270/Q2N29ZBP