BDBM50435905 CHEMBL2391438
SMILES: Cc1cc(Cc2cccc3ccccc23)c(=O)n(CC(=O)Nc2ccc(Br)cc2)n1
InChI Key: InChIKey=YSXUKSMIDAEZEQ-UHFFFAOYSA-N
Data: 1 EC50
Activity Spreadsheet -- Enzyme Inhibition Constant Data from BindingDB
Found 1 hit for monomerid = 50435905
Trg + Lig
Ki
nM
ΔG°
kcal/mole
IC50
nM
Kd
nM
EC50/IC50
nM
koff
s-1
kon
M-1s-1
pHTemp
°C
FML2_HUMAN
(Homo sapiens (Human))
BDBM50435905
(CHEMBL2391438)
Show SMILES Cc1cc(Cc2cccc3ccccc23)c(=O)n(CC(=O)Nc2ccc(Br)cc2)n1
Show InChI InChI=1S/C24H20BrN3O2/c1-16-13-19(14-18-7-4-6-17-5-2-3-8-22(17)18)24(30)28(27-16)15-23(29)26-21-11-9-20(25)10-12-21/h2-13H,14-15H2,1H3,(H,26,29)
NCI pathway
Reactome pathway
n/an/an/an/a>5.00E+4n/an/an/an/a
Universit£ degli Studi di Firenze
Curated by ChEMBL
Assay Description
Agonist activity at FPR3 (unknown origin) transfected in human HL60 cells assessed as induction of Ca2+ mobilization
Eur J Med Chem 64: 512-28 (2013)
Article DOI: 10.1016/j.ejmech.2013.03.066
BindingDB Entry DOI: 10.7270/Q2N29ZBP