null
SMILES: Cc1cc(Cc2ccsc2)c(=O)n(CC(=O)Nc2ccc(Br)cc2)n1
InChI Key: InChIKey=CCHQYZAAGWDVKT-UHFFFAOYSA-N
Activity Spreadsheet -- Enzyme Inhibition Constant Data from BindingDB
Found 1 hit for monomerid = 50435906
Trg + Lig
Ki
nM
ΔG°
kcal/mole
IC50
nM
Kd
nM
EC50/IC50
nM
koff
s-1
kon
M-1s-1
pHTemp
°C
N-formyl peptide receptor 3
(Homo sapiens (Human))
BDBM50435906
(CHEMBL2391286)
Show SMILES Cc1cc(Cc2ccsc2)c(=O)n(CC(=O)Nc2ccc(Br)cc2)n1
Show InChI InChI=1S/C18H16BrN3O2S/c1-12-8-14(9-13-6-7-25-11-13)18(24)22(21-12)10-17(23)20-16-4-2-15(19)3-5-16/h2-8,11H,9-10H2,1H3,(H,20,23)
NCI pathway
Reactome pathway
n/an/an/an/a>5.00E+4n/an/an/an/a
Universit£ degli Studi di Firenze
Curated by ChEMBL
Assay Description
Agonist activity at FPR3 (unknown origin) transfected in human HL60 cells assessed as induction of Ca2+ mobilization
Eur J Med Chem 64: 512-28 (2013)
Article DOI: 10.1016/j.ejmech.2013.03.066
BindingDB Entry DOI: 10.7270/Q2N29ZBP