BDBM50435914 CHEMBL2391278
SMILES: Cc1cc(Cc2ccccc2)c(=O)n(CC(=O)Nc2ccc(F)cc2)n1
InChI Key: InChIKey=JZDSOBVWSSBOKM-UHFFFAOYSA-N
Data: 1 EC50
Activity Spreadsheet -- Enzyme Inhibition Constant Data from BindingDB
Found 1 hit for monomerid = 50435914
Trg + Lig
Ki
nM
ΔG°
kcal/mole
IC50
nM
Kd
nM
EC50/IC50
nM
koff
s-1
kon
M-1s-1
pHTemp
°C
FML2_HUMAN
(Homo sapiens (Human))
BDBM50435914
(CHEMBL2391278)
Show SMILES Cc1cc(Cc2ccccc2)c(=O)n(CC(=O)Nc2ccc(F)cc2)n1
Show InChI InChI=1S/C20H18FN3O2/c1-14-11-16(12-15-5-3-2-4-6-15)20(26)24(23-14)13-19(25)22-18-9-7-17(21)8-10-18/h2-11H,12-13H2,1H3,(H,22,25)
NCI pathway
Reactome pathway
n/an/an/an/a>5.00E+4n/an/an/an/a
Universit£ degli Studi di Firenze
Curated by ChEMBL
Assay Description
Agonist activity at FPR3 (unknown origin) transfected in human HL60 cells assessed as induction of Ca2+ mobilization
Eur J Med Chem 64: 512-28 (2013)
Article DOI: 10.1016/j.ejmech.2013.03.066
BindingDB Entry DOI: 10.7270/Q2N29ZBP