BDBM50435937 CHEMBL2391256
SMILES: COc1cccc(Cc2cc(nn(CC(=O)Nc3ccc(Br)cc3)c2=O)C(C)C)c1
InChI Key: InChIKey=IJHCATOAXCRMJB-UHFFFAOYSA-N
Data: 1 EC50
Activity Spreadsheet -- Enzyme Inhibition Constant Data from BindingDB
Found 1 hit for monomerid = 50435937
Trg + Lig
Ki
nM
ΔG°
kcal/mole
IC50
nM
Kd
nM
EC50/IC50
nM
koff
s-1
kon
M-1s-1
pHTemp
°C
FML2_HUMAN
(Homo sapiens (Human))
BDBM50435937
(CHEMBL2391256)
Show SMILES COc1cccc(Cc2cc(nn(CC(=O)Nc3ccc(Br)cc3)c2=O)C(C)C)c1
Show InChI InChI=1S/C23H24BrN3O3/c1-15(2)21-13-17(11-16-5-4-6-20(12-16)30-3)23(29)27(26-21)14-22(28)25-19-9-7-18(24)8-10-19/h4-10,12-13,15H,11,14H2,1-3H3,(H,25,28)
NCI pathway
Reactome pathway
n/an/an/an/a 1.74E+4n/an/an/an/a
Universit£ degli Studi di Firenze
Curated by ChEMBL
Assay Description
Agonist activity at FPR3 (unknown origin) transfected in human HL60 cells assessed as induction of Ca2+ mobilization
Eur J Med Chem 64: 512-28 (2013)
Article DOI: 10.1016/j.ejmech.2013.03.066
BindingDB Entry DOI: 10.7270/Q2N29ZBP