BDBM50436037 CHEMBL2392144
SMILES: Nc1cc(Br)cc2c1oc(cc2=O)C(O)=O
InChI Key: InChIKey=PPHWKKSLFLMNJG-UHFFFAOYSA-N
Data: 1 KI  1 EC50
Activity Spreadsheet -- Enzyme Inhibition Constant Data from BindingDB
Found 2 hits for monomerid = 50436037
Trg + Lig
Ki
nM
ΔG°
kcal/mole
IC50
nM
Kd
nM
EC50/IC50
nM
koff
s-1
kon
M-1s-1
pHTemp
°C
G-protein coupled receptor 35
(Homo sapiens (Human))
BDBM50436037
(CHEMBL2392144)
Show SMILES Nc1cc(Br)cc2c1oc(cc2=O)C(O)=O
Show InChI InChI=1S/C10H6BrNO4/c11-4-1-5-7(13)3-8(10(14)15)16-9(5)6(12)2-4/h1-3H,12H2,(H,14,15)
3.01E+3n/an/an/an/an/an/an/an/a
University of Bonn
Curated by ChEMBL
Assay Description
Displacement of [3H]PSB-13253 from human recombinant GPR35 exprssed in CHO cells by liquid scintillation counting analysis
J Med Chem 56: 7084-99 (2013)
Checked by Author
Article DOI: 10.1021/jm4009373
BindingDB Entry DOI: 10.7270/Q2G16280
G-protein coupled receptor 35
(Homo sapiens (Human))
BDBM50436037
(CHEMBL2392144)
Show SMILES Nc1cc(Br)cc2c1oc(cc2=O)C(O)=O
Show InChI InChI=1S/C10H6BrNO4/c11-4-1-5-7(13)3-8(10(14)15)16-9(5)6(12)2-4/h1-3H,12H2,(H,14,15)
n/an/an/an/a 1.26E+4n/an/an/an/a
University of Bonn
Curated by ChEMBL
Assay Description
Agonist activity at human GPR35 expressed in CHO cells assessed as induction of beta-arrestin recruitment after 90 mins by beta-galactosidase reporte...
J Med Chem 56: 5182-97 (2013)
Article DOI: 10.1021/jm400587g
BindingDB Entry DOI: 10.7270/Q20C4X5B