BDBM50436221 CHEMBL2398700
SMILES: FC(F)(F)c1cc(cc(c1)C(F)(F)F)C(=O)N1CCCC(C1)C(=O)Nc1cccc(c1)S(=O)(=O)N1CCCC1
InChI Key: InChIKey=LQAKWNUACGLQAS-UHFFFAOYSA-N
Data: 1 IC50
Activity Spreadsheet -- Enzyme Inhibition Constant Data from BindingDB
Found 1 hit for monomerid = 50436221
Trg + Lig
Ki
nM
ΔG°
kcal/mole
IC50
nM
Kd
nM
EC50/IC50
nM
koff
s-1
kon
M-1s-1
pHTemp
°C
Transforming protein RhoA
(Homo sapiens (Human))
BDBM50436221
(CHEMBL2398700)
Show SMILES FC(F)(F)c1cc(cc(c1)C(F)(F)F)C(=O)N1CCCC(C1)C(=O)Nc1cccc(c1)S(=O)(=O)N1CCCC1
Show InChI InChI=1S/C25H25F6N3O4S/c26-24(27,28)18-11-17(12-19(13-18)25(29,30)31)23(36)33-8-4-5-16(15-33)22(35)32-20-6-3-7-21(14-20)39(37,38)34-9-1-2-10-34/h3,6-7,11-14,16H,1-2,4-5,8-10,15H2,(H,32,35)
Reactome pathway
n/an/a 5.60E+3n/an/an/an/an/an/a
College of Pharmacy
Curated by ChEMBL
Assay Description
Inhibition of RhoC-mediated pathway in human PC3 cells assessed as inhibition of SRE-regulated gene transcription by luciferase reporter gene assay
Bioorg Med Chem Lett 23: 3826-32 (2013)
Article DOI: 10.1016/j.bmcl.2013.04.080
BindingDB Entry DOI: 10.7270/Q28P61XS