BDBM50436373 CHEMBL2396727
SMILES: OC(=O)c1cc2c(C#C)c(oc2cc1O)-c1cccc2ccccc12
InChI Key: InChIKey=DAQFDYBGYTXLMM-UHFFFAOYSA-N
Data: 1 IC50
Activity Spreadsheet -- Enzyme Inhibition Constant Data from BindingDB
Found 1 hit for monomerid = 50436373
Trg + Lig
Ki
nM
ΔG°
kcal/mole
IC50
nM
Kd
nM
EC50/IC50
nM
koff
s-1
kon
M-1s-1
pHTemp
°C
Tyrosine-protein phosphatase non-receptor type 22
(Homo sapiens (Human))
BDBM50436373
(CHEMBL2396727)
Show SMILES OC(=O)c1cc2c(C#C)c(oc2cc1O)-c1cccc2ccccc12
Show InChI InChI=1S/C21H12O4/c1-2-13-16-10-17(21(23)24)18(22)11-19(16)25-20(13)15-9-5-7-12-6-3-4-8-14(12)15/h1,3-11,22H,(H,23,24)
n/an/a 8.40E+3n/an/an/an/an/an/a
Indiana University School of Medicine
Curated by ChEMBL
Assay Description
Inhibition of N-terminal 6xHis-tagged LYP catalytic domain (1 to 303) (unknown origin) expressed in Escherichia coli BL21(DE3) using pNPP as substrat...
J Med Chem 56: 4990-5008 (2013)
Article DOI: 10.1021/jm400248c
BindingDB Entry DOI: 10.7270/Q2N017XW