BDBM50436374 CHEMBL2396726
SMILES: OC(=O)COc1ccc(cc1)-c1oc2cc(O)c(cc2c1C#Cc1cccc(Cl)c1)C(O)=O
InChI Key: InChIKey=MVXDJODNTDKLTA-UHFFFAOYSA-N
Data: 1 IC50
Activity Spreadsheet -- Enzyme Inhibition Constant Data from BindingDB
Found 1 hit for monomerid = 50436374
Trg + Lig
Ki
nM
ΔG°
kcal/mole
IC50
nM
Kd
nM
EC50/IC50
nM
koff
s-1
kon
M-1s-1
pHTemp
°C
Hematopoietic cell protein-tyrosine phosphatase 70Z-PEP
(Homo sapiens (Human))
BDBM50436374
(CHEMBL2396726)
Show SMILES OC(=O)COc1ccc(cc1)-c1oc2cc(O)c(cc2c1C#Cc1cccc(Cl)c1)C(O)=O
Show InChI InChI=1S/C25H15ClO7/c26-16-3-1-2-14(10-16)4-9-18-19-11-20(25(30)31)21(27)12-22(19)33-24(18)15-5-7-17(8-6-15)32-13-23(28)29/h1-3,5-8,10-12,27H,13H2,(H,28,29)(H,30,31)
n/an/a 7.80E+3n/an/an/an/an/an/a
Indiana University School of Medicine
Curated by ChEMBL
Assay Description
Inhibition of N-terminal 6xHis-tagged LYP catalytic domain (1 to 294) (unknown origin) expressed in Escherichia coli BL21(DE3) using pNPP as substrat...
J Med Chem 56: 4990-5008 (2013)
Article DOI: 10.1021/jm400248c
BindingDB Entry DOI: 10.7270/Q2N017XW