BDBM50436461 CHEMBL2397190
SMILES: Cc1nc(NC(=O)N2CCC[C@@H]2C(N)=O)sc1-c1ccnc(c1)C(C)(C)C
InChI Key: InChIKey=VNGAUNCZCLFPCA-CYBMUJFWSA-N
Data: 4 IC50
Activity Spreadsheet -- Enzyme Inhibition Constant Data from BindingDB
Found 4 hits for monomerid = 50436461
Trg + Lig
Ki
nM
ΔG°
kcal/mole
IC50
nM
Kd
nM
EC50/IC50
nM
koff
s-1
kon
M-1s-1
pHTemp
°C
Phosphatidylinositol 4,5-bisphosphate 3-kinase catalytic subunit alpha isoform
(Homo sapiens (Human))
BDBM50436461
(CHEMBL2397190)
Show SMILES Cc1nc(NC(=O)N2CCC[C@@H]2C(N)=O)sc1-c1ccnc(c1)C(C)(C)C |r|
Show InChI InChI=1S/C19H25N5O2S/c1-11-15(12-7-8-21-14(10-12)19(2,3)4)27-17(22-11)23-18(26)24-9-5-6-13(24)16(20)25/h7-8,10,13H,5-6,9H2,1-4H3,(H2,20,25)(H,22,23,26)/t13-/m1/s1
NCI pathway
Reactome pathway
n/an/a>9.10E+3n/an/an/an/an/an/a
Novartis Institutes for BioMedical Research
Curated by ChEMBL
Assay Description
Inhibition of P110alpha (unknown origin) using L-a-phosphatidylinositol as substrate by luminescence assay
Bioorg Med Chem Lett 23: 3741-8 (2013)
Article DOI: 10.1016/j.bmcl.2013.05.007
BindingDB Entry DOI: 10.7270/Q2M046VD
Phosphatidylinositol 4,5-bisphosphate 3-kinase catalytic subunit beta isoform
(Homo sapiens (Human))
BDBM50436461
(CHEMBL2397190)
Show SMILES Cc1nc(NC(=O)N2CCC[C@@H]2C(N)=O)sc1-c1ccnc(c1)C(C)(C)C |r|
Show InChI InChI=1S/C19H25N5O2S/c1-11-15(12-7-8-21-14(10-12)19(2,3)4)27-17(22-11)23-18(26)24-9-5-6-13(24)16(20)25/h7-8,10,13H,5-6,9H2,1-4H3,(H2,20,25)(H,22,23,26)/t13-/m1/s1
NCI pathway
Reactome pathway
n/an/a 8.20E+3n/an/an/an/an/an/a
Novartis Institutes for BioMedical Research
Curated by ChEMBL
Assay Description
Inhibition of P110beta (unknown origin) using L-a-phosphatidylinositol as substrate by luminescence assay
Bioorg Med Chem Lett 23: 3741-8 (2013)
Article DOI: 10.1016/j.bmcl.2013.05.007
BindingDB Entry DOI: 10.7270/Q2M046VD
Phosphatidylinositol 4,5-bisphosphate 3-kinase catalytic subunit delta isoform
(Homo sapiens (Human))
BDBM50436461
(CHEMBL2397190)
Show SMILES Cc1nc(NC(=O)N2CCC[C@@H]2C(N)=O)sc1-c1ccnc(c1)C(C)(C)C |r|
Show InChI InChI=1S/C19H25N5O2S/c1-11-15(12-7-8-21-14(10-12)19(2,3)4)27-17(22-11)23-18(26)24-9-5-6-13(24)16(20)25/h7-8,10,13H,5-6,9H2,1-4H3,(H2,20,25)(H,22,23,26)/t13-/m1/s1
NCI pathway
Reactome pathway
n/an/a 3.30E+3n/an/an/an/an/an/a
Novartis Institutes for BioMedical Research
Curated by ChEMBL
Assay Description
Inhibition of P110delta (unknown origin) using PIP2:PS as substrate by TR-FRET assay
Bioorg Med Chem Lett 23: 3741-8 (2013)
Article DOI: 10.1016/j.bmcl.2013.05.007
BindingDB Entry DOI: 10.7270/Q2M046VD
Phosphatidylinositol 4,5-bisphosphate 3-kinase catalytic subunit gamma isoform
(Homo sapiens (Human))
BDBM50436461
(CHEMBL2397190)
Show SMILES Cc1nc(NC(=O)N2CCC[C@@H]2C(N)=O)sc1-c1ccnc(c1)C(C)(C)C |r|
Show InChI InChI=1S/C19H25N5O2S/c1-11-15(12-7-8-21-14(10-12)19(2,3)4)27-17(22-11)23-18(26)24-9-5-6-13(24)16(20)25/h7-8,10,13H,5-6,9H2,1-4H3,(H2,20,25)(H,22,23,26)/t13-/m1/s1
NCI pathway
Reactome pathway
n/an/a>1.00E+4n/an/an/an/an/an/a
Novartis Institutes for BioMedical Research
Curated by ChEMBL
Assay Description
Inhibition of P110gamma (unknown origin) using PIP2:PS as substrate by TR-FRET assay
Bioorg Med Chem Lett 23: 3741-8 (2013)
Article DOI: 10.1016/j.bmcl.2013.05.007
BindingDB Entry DOI: 10.7270/Q2M046VD