BDBM50436696 CHEMBL2398658
SMILES: CCN(CC)CCOc1ccc(cc1)-c1cc2c(NCCc3ccc(NC(=O)Nc4ccccc4)cc3)ncnc2o1
InChI Key: InChIKey=VTPQFEHGMAIXDV-UHFFFAOYSA-N
Data: 1 IC50
Activity Spreadsheet -- Enzyme Inhibition Constant Data from BindingDB
Found 1 hit for monomerid = 50436696
Trg + Lig
Ki
nM
ΔG°
kcal/mole
IC50
nM
Kd
nM
EC50/IC50
nM
koff
s-1
kon
M-1s-1
pHTemp
°C
Aurora kinase A
(Homo sapiens (Human))
BDBM50436696
(CHEMBL2398658)
Show SMILES CCN(CC)CCOc1ccc(cc1)-c1cc2c(NCCc3ccc(NC(=O)Nc4ccccc4)cc3)ncnc2o1
Show InChI InChI=1S/C33H36N6O3/c1-3-39(4-2)20-21-41-28-16-12-25(13-17-28)30-22-29-31(35-23-36-32(29)42-30)34-19-18-24-10-14-27(15-11-24)38-33(40)37-26-8-6-5-7-9-26/h5-17,22-23H,3-4,18-21H2,1-2H3,(H,34,35,36)(H2,37,38,40)
NCI pathway
Reactome pathway
n/an/a 18n/an/an/an/an/an/a
National Health Research Institutes
Curated by ChEMBL
Assay Description
Inhibition of GST-tagged Aurora kinase A catalytic domain (123 to 401 amino acids) (unknown origin) expressed in sf9 cells using tetra(LRRWSLG) as su...
J Med Chem 56: 5247-60 (2014)
Article DOI: 10.1021/jm4006059
BindingDB Entry DOI: 10.7270/Q2J104K6