BDBM50436697 CHEMBL2398648
SMILES: O=C(Nc1ccccc1)Nc1ccc(CCCNc2ncnc3oc(c(-c4ccccc4)c23)-c2ccccc2)cc1
InChI Key: InChIKey=KBTXSMIADHLVRF-UHFFFAOYSA-N
Data: 1 IC50
Activity Spreadsheet -- Enzyme Inhibition Constant Data from BindingDB
Found 1 hit for monomerid = 50436697
Trg + Lig
Ki
nM
ΔG°
kcal/mole
IC50
nM
Kd
nM
EC50/IC50
nM
koff
s-1
kon
M-1s-1
pHTemp
°C
Aurora kinase A
(Homo sapiens (Human))
BDBM50436697
(CHEMBL2398648)
Show SMILES O=C(Nc1ccccc1)Nc1ccc(CCCNc2ncnc3oc(c(-c4ccccc4)c23)-c2ccccc2)cc1
Show InChI InChI=1S/C34H29N5O2/c40-34(38-27-16-8-3-9-17-27)39-28-20-18-24(19-21-28)11-10-22-35-32-30-29(25-12-4-1-5-13-25)31(26-14-6-2-7-15-26)41-33(30)37-23-36-32/h1-9,12-21,23H,10-11,22H2,(H,35,36,37)(H2,38,39,40)
NCI pathway
Reactome pathway
n/an/a>1.00E+4n/an/an/an/an/an/a
National Health Research Institutes
Curated by ChEMBL
Assay Description
Inhibition of GST-tagged Aurora kinase A catalytic domain (123 to 401 amino acids) (unknown origin) expressed in sf9 cells using tetra(LRRWSLG) as su...
J Med Chem 56: 5247-60 (2014)
Article DOI: 10.1021/jm4006059
BindingDB Entry DOI: 10.7270/Q2J104K6