null
SMILES: O=C(Nc1ccccc1)Nc1ccc(CCNc2ncnc3oc(cc23)-c2ccccc2)cc1
InChI Key: InChIKey=NFLOTXOSGLXAJZ-UHFFFAOYSA-N
Activity Spreadsheet -- Enzyme Inhibition Constant Data from BindingDB
Found 1 hit for monomerid = 50436707
Trg + Lig
Ki
nM
ΔG°
kcal/mole
IC50
nM
Kd
nM
EC50/IC50
nM
koff
s-1
kon
M-1s-1
pHTemp
°C
Aurora kinase A
(Homo sapiens (Human))
BDBM50436707
(CHEMBL2398655)
Show SMILES O=C(Nc1ccccc1)Nc1ccc(CCNc2ncnc3oc(cc23)-c2ccccc2)cc1
Show InChI InChI=1S/C27H23N5O2/c33-27(31-21-9-5-2-6-10-21)32-22-13-11-19(12-14-22)15-16-28-25-23-17-24(20-7-3-1-4-8-20)34-26(23)30-18-29-25/h1-14,17-18H,15-16H2,(H,28,29,30)(H2,31,32,33)
NCI pathway
Reactome pathway
n/an/a 140n/an/an/an/an/an/a
National Health Research Institutes
Curated by ChEMBL
Assay Description
Inhibition of GST-tagged Aurora kinase A catalytic domain (123 to 401 amino acids) (unknown origin) expressed in sf9 cells using tetra(LRRWSLG) as su...
J Med Chem 56: 5247-60 (2014)
Article DOI: 10.1021/jm4006059
BindingDB Entry DOI: 10.7270/Q2J104K6