BDBM50437369 CHEMBL3037913
SMILES: CCOc1cc(nc2c(F)c(ccc12)-c1nc([C@H]2C[C@@](C)(O)C2)n2ccnc(N)c12)-c1ccccc1
InChI Key: InChIKey=TVXAIWDTRFFVCZ-OOTKOPMESA-N
Data: 1 IC50
Activity Spreadsheet -- Enzyme Inhibition Constant Data from BindingDB
Found 1 hit for monomerid = 50437369
Trg + Lig
Ki
nM
ΔG°
kcal/mole
IC50
nM
Kd
nM
EC50/IC50
nM
koff
s-1
kon
M-1s-1
pHTemp
°C
Insulin-like growth factor I receptor
(Homo sapiens (Human))
BDBM50437369
(CHEMBL3037913)
Show SMILES CCOc1cc(nc2c(F)c(ccc12)-c1nc([C@H]2C[C@@](C)(O)C2)n2ccnc(N)c12)-c1ccccc1 |r,wU:19.22,17.18,wD:19.21,(23.32,-.37,;24.65,-1.14,;24.65,-2.69,;25.99,-3.46,;27.32,-2.69,;28.65,-3.45,;28.66,-5,;27.32,-5.77,;27.32,-7.31,;28.66,-8.07,;26,-8.08,;24.65,-7.32,;24.65,-5.77,;25.98,-5,;26.01,-9.63,;27.26,-10.53,;26.79,-11.99,;27.7,-13.24,;29.23,-13.47,;28.99,-14.99,;30.47,-15.38,;29.39,-16.47,;27.47,-14.76,;25.25,-12,;24.23,-13.15,;22.72,-12.82,;22.25,-11.36,;23.28,-10.22,;22.8,-8.76,;24.77,-10.54,;29.98,-2.68,;31.32,-3.45,;32.65,-2.67,;32.64,-1.13,;31.3,-.36,;29.97,-1.14,)|
Show InChI InChI=1S/C28H26FN5O2/c1-3-36-21-13-20(16-7-5-4-6-8-16)32-23-18(21)9-10-19(22(23)29)24-25-26(30)31-11-12-34(25)27(33-24)17-14-28(2,35)15-17/h4-13,17,35H,3,14-15H2,1-2H3,(H2,30,31)/t17-,28+
Reactome pathway
n/an/a 5n/an/an/an/an/an/a
OSI Pharmaceuticals, LLC
Curated by ChEMBL
Assay Description
Inhibition of full length human IGF-1R overexpressed in mouse NIH 3T3 cells assessed as IGF1-induced protein phosphorylation incubated for 2 hrs prio...
ACS Med Chem Lett 4: 627-31 (2013)
Article DOI: 10.1021/ml400160a
BindingDB Entry DOI: 10.7270/Q2S75HR4